program: Gaussian 09
title: 000072687
version: EM64L-G09RevD.01
frameworkgroup: C1[X(C5H8N6O2)]
method: RPBEPBE
basis: SDD
operation: Freq
keyword: #pfreq=noraman
keyword: PBEPBE/SDD
title: #p freq=noraman PBEPBE/SDD
converged: YES YES NO NO
title: Mulliken charges:
elementType: O O N N N N N N C C C C C H H H H H H H H
charge: -0.349631 -0.334956 -0.386259 -0.123293 -0.366925 -0.368499 -0.494968 -0.502565 0.188409 -0.019347 0.147769 -0.214448 0.202252 0.355561 0.271232 0.399780 0.365089 0.319964 0.296861 0.307632 0.306342
chargesum: 0.00000
title: Mulliken charges with hydrogens summed into heavy atoms:
elementType: O O N N N N N N C C C C C
charge: -0.349631 -0.334956 -0.030698 -0.123293 0.032856 -0.003410 0.121857 0.111410 0.188409 -0.019347 0.147769 0.056783 0.202252
polarizability: 1.45928723e+02 8.56331222e+00 1.40341361e+02 1.03201403e+00 -1.21852828e+00 4.87043618e+01
1716.lowfreq: -0.0007 -0.0001 0.0007 4.5048 6.6045 10.6898 66.9868 85.4576 98.2704
frequency: 66.9616 85.4248 98.2650 131.4913 142.4469 167.2694 180.7560 225.7625 234.4548 292.1497 295.7550 314.6942 356.1216 362.6699 475.5018 572.6551 596.9979 643.0586 704.0949 714.3371 755.2965 767.3830 786.9942 789.7665 807.7232 817.6900 863.9497 929.3500 934.2773 1014.5050 1087.4681 1094.6902 1151.1460 1204.3883 1223.7513 1270.2856 1281.9972 1290.5351 1315.2135 1348.3618 1387.3969 1446.1520 1482.1318 1522.5191 1549.6706 1578.6969 1606.2438 1654.9240 1673.7888 3034.5307 3249.3033 3384.7787 3396.6127 3514.2115 3514.9970 3523.5632 3533.4754
redmass: 7.3221 1.6208 5.2617 4.2620 2.1086 6.1430 4.7986 1.3528 4.6299 4.1637 4.9434 6.9675 6.7520 4.4760 7.5512 7.8120 6.7495 5.2117 6.7479 1.1279 1.5627 3.7598 1.3704 1.5116 5.1831 1.5075 7.6085 8.1260 1.0757 3.6924 1.7969 3.6134 3.3516 2.5591 3.4951 2.7131 1.1612 1.4145 2.6719 2.9823 4.8962 2.9867 2.6917 2.9392 4.9500 6.7067 2.0329 1.1880 1.0619 1.0988 1.0995 1.0427 1.0427 1.0796 1.0992 1.0995 1.0820
irintensity: 0.4234 15.6629 16.1674 4.6973 32.1306 1.8495 5.1642 88.0739 1.0809 30.4664 35.9641 31.3915 18.5909 13.0224 2.2711 6.8667 3.0122 21.4792 18.3297 108.0037 149.1197 17.9814 372.6601 64.6302 61.0903 7.0330 38.0939 2.5474 151.2539 31.8246 17.4441 6.3333 18.1358 30.9796 8.7309 6.2778 0.0852 17.5119 5.7168 20.5796 6.0397 16.4602 286.5852 346.1673 190.7609 5.6940 14.2151 16.5803 34.0869 512.2509 1.0208 15.0468 0.4902 70.8076 2.7165 10.0421 109.4810
temp: 298.150 k
press: 1.00000 atm
elementType: 8 8 7 7 7 7 7 7 6 6 6 6 6 1 1 1 1 1 1 1 1
symmnumber: 1
zpe: 409413.8 jmol-1
zpe.correction: 0.155937 hartree
zpe.thermalcorrener: 0.168420 hartree
zpe.thermalcorrenthalpy: 0.169364 hartree
zpe.thermalcorrgfe: 0.117018 hartree
zpe.sumelectzpe: -673.304606 hartree
zpe.sumelectthermal: -673.292124 hartree
zpe.sumelectthermalent: -673.291180 hartree
zpe.sumelectthermalfe: -673.343525 hartree
dipole: 0.4965 1.0726 1.1740
dipole: 1.6659
quadrupole: -81.4580 -61.8413 -75.3954
quadrupole: -2.9194 -3.3365 -4.3704
quadrupole: -8.5598 11.0569 -2.4972 -2.9194 -3.3365 -4.3704
hfenergy: -673.4605438 hartree
pointgroup: C01 [X(C5H8N6O2)]
dipole: 0.1929783 -0.5326013 -0.3296498 debye
dipolederiv: -0.9203607 -0.3831718 0.1773126 -0.0798209 -0.6594782 0.1087676 0.0976748 0.1480111 -0.4647302 -0.9046633 0.0250121 0.0304262 0.1885189 -0.7963318 0.1307206 -0.0038079 0.1428861 -0.4213854 -0.353721 -0.198204 0.0751445 -0.3408431 -0.3782886 0.0826156 0.1389717 0.0646285 -0.2430991 -0.4613184 -0.0292529 0.0292533 0.2158364 -0.3906427 0.0193745 -0.0518295 0.0442574 -0.2647904 -0.2514755 -0.519658 0.153548 -0.4308699 -0.2101881 0.1620269 0.1515604 0.1705822 -0.4379727 -1.0313895 -0.0651796 0.0779949 0.2197706 -0.0856884 -0.1296157 -0.0287887 -0.1071395 -0.3807297 -0.4511952 0.2394061 -0.0717652 0.365197 -0.9132729 -0.0430085 0.0701278 -0.2281232 -0.1375584 -0.4649685 0.0708935 0.0104538 0.1515958 -0.1188844 0.0133833 -0.0168076 0.0198531 -0.0456574 0.0234094 0.1501925 -0.0604918 0.2429941 0.2633701 -0.0749295 -0.1134897 -0.0352265 0.0894718 -0.2526384 -0.1293095 0.0683467 -0.4355442 -0.1303441 0.0802661 0.1742526 0.0395815 -0.0594253 1.0526249 0.402879 -0.2081232 0.2165831 0.7905264 -0.3194631 -0.2323563 -0.2403744 0.3158527 0.1254428 0.0744536 -0.0404757 -0.0153799 0.114302 -0.0539546 -0.0058447 -0.0669709 -0.031339 1.6679707 0.0488989 -0.1382866 0.0726466 0.8677093 -0.2235418 -0.1439606 -0.207725 0.3283476 0.2800981 -0.0047274 0.0101387 0.0205668 0.3287392 0.0020774 -0.0039744 0.0127068 0.337816 0.0997614 -0.0035366 0.010139 -0.0038586 0.0191944 0.0588994 0.0112023 0.0559012 0.1739368 0.7336589 0.100282 -0.0561401 0.0982187 0.2038237 0.0258297 -0.0137711 -0.0865228 0.3598218 0.2818891 -0.0090253 0.0066819 -0.0461644 0.2171014 0.0459329 0.0163218 0.0444825 0.3246667 0.1771449 -0.0160269 0.0080139 -0.1193042 0.2108744 0.1044372 -0.0389748 0.093717 0.2809482 0.1119908 0.1560738 -0.0279344 -0.1114698 0.4842142 -0.0264136 -0.0548664 0.1228093 0.0461319 0.2859033 0.085147 0.099857 -0.0758313 0.0587541 -0.0491036 0.123528 -0.0211652 0.1315392 0.2518361 0.0048534 -0.1540935 -0.1328417 0.1245101 0.0856993 -0.0751677 0.0338309 0.0981549 unknown
polarizability: 146.571427|-10.6441014|129.4243387|-6.8119196|-27.2308591|58.9786802 unknown
InChI: InChI=1S/C5H8N6O2/c6-10-4(12)2-3(5(13)11-7)9-1-8-2/h1,8,10-11H,6-7H2
charge 0 multiplicity 1
21 atoms
O  -3.213503 -0.767381 0.461389
O  0.68245 1.480787 -0.718549
N  -0.942854 -2.326843 0.716737
N  1.260762 -1.999573 0.390023
N  -1.962045 1.032627 -0.361251
N  2.636906 0.23568 -0.464292
N  -3.098574 1.879636 -0.367811
N  3.51326 1.269974 -0.876333
C  -0.829912 -1.016034 0.259934
C  0.55467 -0.825078 0.05967
C  -2.085873 -0.242606 0.116906
C  0.324066 -2.884467 0.780467
C  1.269711 0.380749 -0.401442
H  -1.854339 -2.729705 0.953719
H  0.516064 -3.903432 1.105386
H  -1.007994 1.443298 -0.528266
H  3.049387 -0.66268 -0.194776
H  -3.8874 1.367298 0.056609
H  -3.307518 2.219148 -1.315882
H  3.438307 2.081444 -0.246831
H  3.316729 1.546759 -1.848506
