program: Orca
programVersion: 5.0.2
elementType: Cl Cl O O O N C C C C C C C C C C C C C C C C C C C C C C H H H H H H H H H H H H H H H H H H H
charge: 0
multiplicity: 1
keywords: wb97x-d3
keywords: def2-TZVPP
keywords: def2/J RIJCOSX
keywords: DEFGRID2
keywords: scfconv7
keywords: smallprint printgap noloewdin
keywords: NOSOSCF
formula: C22H19Cl2NO3
InChI: InChI=1/C22H19Cl2NO3/c1-22(2)17(12-19(23)24)20(22)21(26)28-18(13-25)14-7-6-10-16(11-14)27-15-8-4-3-5-9-15/h3-12,17-18,20H,1-2H3
47 atoms
Cl -3.102319 -3.568073 -3.361709
Cl -4.085011 -5.5233 -1.483684
O  1.635907 -1.672908 0.711825
O  1.038817 -1.188544 -1.385159
O  0.561666 3.041754 1.610927
N  4.258051 -2.222849 -1.365086
C  -1.778062 -1.157688 0.143583
C  -1.690729 -2.284236 -0.848456
C  -0.574743 -2.085556 0.151258
C  -1.661172 0.247749 -0.392515
C  -2.697875 -1.262133 1.334589
C  -2.519413 -3.490347 -0.727088
C  0.7421 -1.608965 -0.296273
C  -3.143549 -4.10156 -1.725741
C  2.882286 -1.029161 0.512167
C  2.740552 0.468447 0.321547
C  3.631034 -1.681439 -0.5672
C  1.770679 1.130175 1.062758
C  3.574403 1.185083 -0.525597
C  1.606923 2.500436 0.920731
C  3.415685 2.559369 -0.635849
C  2.428924 3.229505 0.070215
C  0.556433 4.358642 1.998165
C  1.647563 4.952833 2.618841
C  -0.627232 5.058695 1.816335
C  1.541708 6.266134 3.055285
C  -0.722476 6.36665 2.269378
C  0.36083 6.97708 2.886121
H  -1.461606 -1.970458 -1.860588
H  -0.54174 -2.771765 0.990263
H  -1.245232 0.919319 0.360697
H  -2.654438 0.619034 -0.649999
H  -1.047346 0.318892 -1.287984
H  -3.718619 -0.999138 1.052041
H  -2.379043 -0.566714 2.112376
H  -2.716832 -2.257857 1.77501
H  -2.628912 -3.930323 0.257125
H  3.439552 -1.223942 1.432522
H  1.119006 0.596557 1.743742
H  4.341661 0.690941 -1.107428
H  4.060475 3.117286 -1.301515
H  2.305454 4.297045 -0.055773
H  2.568404 4.403547 2.769621
H  -1.469495 4.577401 1.335586
H  2.389987 6.731593 3.53968
H  -1.649448 6.908626 2.135363
H  0.284422 7.997337 3.237402
elementType: Cl O N C H
totalener: -2050.67145640 hartree
nucrepener: 2729.83727069 hartree
electener: -4780.50872708 hartree
oneelecener: -8235.36049167 hartree
twoeener: 3454.85176458 hartree
cpcmener: -0.04017354 hartree
kineticenergy: 2044.44743661 hartree
xcener: -151.864415055082 hartree
chargesum: 0.0000000
charge: -0.056726 -0.061542 -0.290048 -0.447333 -0.333271 -0.093218 0.095208 0.025404 -0.048596 -0.266546 -0.264141 -0.202481 0.372181 0.036391 0.508397 0.000575 -0.247676 -0.357711 -0.213082 0.349013 -0.115505 -0.222405 0.283578 -0.201952 -0.247357 -0.147061 -0.128094 -0.181933 0.080218 0.102940 0.089322 0.108964 0.097988 0.102158 0.099174 0.093019 0.134643 0.150097 0.143317 0.134967 0.163654 0.159114 0.160734 0.150509 0.161877 0.161327 0.161908
qa: -0.0567 -0.0615 -0.2900 -0.4473 -0.3333 -0.0932 0.0952 0.0254 -0.0486 -0.2665 -0.2641 -0.2025 0.3722 0.0364 0.5084 0.0006 -0.2477 -0.3577 -0.2131 0.3490 -0.1155 -0.2224 0.2836 -0.2020 -0.2474 -0.1471 -0.1281 -0.1819 0.0802 0.1029 0.0893 0.1090 0.0980 0.1022 0.0992 0.0930 0.1346 0.1501 0.1433 0.1350 0.1637 0.1591 0.1607 0.1505 0.1619 0.1613 0.1619
va: 1.2689 1.2437 2.1268 2.0543 2.0547 3.1055 3.7297 3.9119 3.8298 3.8947 3.9029 3.8910 4.1802 4.2071 3.7791 3.7131 4.1126 4.0551 3.9651 3.6608 3.9208 3.9594 3.6825 3.9281 3.9972 3.8898 3.8807 3.8942 1.0467 1.0325 1.0076 1.0020 1.0145 1.0010 1.0018 1.0051 1.0160 0.9882 1.0232 1.0164 0.9896 0.9963 0.9958 1.0045 0.9891 0.9887 0.9891
dispcorr: -0.024889662 hartree
energy: -2050.696346059653
dipole: 9.01259 -9.64461 -0.63202 38.07690 -35.95732 2.11958 21.89042 -18.90515 2.98527
magnitude: 3.71536 au
magnitude: 9.44370 debye
