program: Orca
programVersion: 5.0.2
elementType: Cl Cl O O O N C C C C C C C C C C C C C C C C C C C C C C H H H H H H H H H H H H H H H H H H H
charge: 0
multiplicity: 1
keywords: wb97x-d3
keywords: def2-TZVPP
keywords: def2/J RIJCOSX
keywords: DEFGRID2
keywords: scfconv7
keywords: smallprint printgap noloewdin
keywords: NOSOSCF
formula: C22H19Cl2NO3
InChI: InChI=1/C22H19Cl2NO3/c1-22(2)17(12-19(23)24)20(22)21(26)28-18(13-25)14-7-6-10-16(11-14)27-15-8-4-3-5-9-15/h3-12,17-18,20H,1-2H3
47 atoms
Cl -3.783593 -1.549011 2.152536
Cl -5.323577 -1.148218 -0.252361
O  1.748343 -1.917912 -1.035969
O  1.147321 -2.172493 1.101538
O  1.52115 3.166643 -1.104235
N  4.586344 -1.49907 -2.684783
C  -1.00099 -4.052075 -0.300554
C  -1.624094 -2.793942 0.229795
C  -0.396764 -2.706018 -0.655232
C  -0.31413 -4.96202 0.686752
C  -1.653873 -4.799241 -1.437176
C  -2.894238 -2.273865 -0.289626
C  0.874404 -2.250745 -0.069874
C  -3.857255 -1.72762 0.441679
C  3.008083 -1.42099 -0.603332
C  2.931265 -0.004859 -0.083498
C  3.872575 -1.476215 -1.783266
C  2.233465 0.95673 -0.802978
C  3.562996 0.3234 1.106178
C  2.179627 2.256847 -0.324788
C  3.508652 1.631335 1.566295
C  2.822928 2.605015 0.858505
C  0.856944 4.221551 -0.52431
C  0.989749 5.462247 -1.129247
C  0.033379 4.052191 0.581836
C  0.288364 6.546556 -0.619793
C  -0.651355 5.147661 1.087551
C  -0.528446 6.39645 0.492151
H  -1.436049 -2.61211 1.281676
H  -0.55804 -2.392547 -1.680317
H  0.517518 -5.487119 0.213869
H  -1.021232 -5.714734 1.038549
H  0.065881 -4.439565 1.561761
H  -2.060081 -4.142861 -2.20541
H  -2.466334 -5.424882 -1.06386
H  -0.926385 -5.453819 -1.919567
H  -3.065016 -2.329702 -1.358081
H  3.451397 -2.07617 0.153769
H  1.735549 0.708258 -1.733076
H  4.096148 -0.433416 1.666823
H  4.00634 1.898972 2.488551
H  2.797348 3.621899 1.227813
H  1.631417 5.576797 -1.993541
H  -0.081503 3.080478 1.045549
H  0.389208 7.51385 -1.094092
H  -1.291623 5.018007 1.950136
H  -1.068669 7.244828 0.890309
elementType: Cl O N C H
totalener: -2050.67304291 hartree
nucrepener: 2718.83806419 hartree
electener: -4769.51110710 hartree
oneelecener: -8213.27225183 hartree
twoeener: 3443.76114473 hartree
cpcmener: -0.03747319 hartree
kineticenergy: 2044.45211012 hartree
xcener: -151.860941942278 hartree
chargesum: 0.0000000
charge: -0.057623 -0.061025 -0.286437 -0.462993 -0.337005 -0.101707 0.085519 0.031474 -0.074074 -0.263205 -0.265148 -0.203588 0.400002 0.040325 0.423521 0.005051 -0.218754 -0.238465 -0.196059 0.252554 -0.134688 -0.180903 0.281187 -0.246355 -0.190611 -0.128004 -0.148945 -0.183221 0.078368 0.101489 0.102032 0.099630 0.092921 0.093778 0.102083 0.099321 0.133949 0.146018 0.138674 0.149970 0.164395 0.160900 0.148967 0.160828 0.161144 0.162829 0.161878
qa: -0.0576 -0.0610 -0.2864 -0.4630 -0.3370 -0.1017 0.0855 0.0315 -0.0741 -0.2632 -0.2651 -0.2036 0.4000 0.0403 0.4235 0.0051 -0.2188 -0.2385 -0.1961 0.2526 -0.1347 -0.1809 0.2812 -0.2464 -0.1906 -0.1280 -0.1489 -0.1832 0.0784 0.1015 0.1020 0.0996 0.0929 0.0938 0.1021 0.0993 0.1339 0.1460 0.1387 0.1500 0.1644 0.1609 0.1490 0.1608 0.1611 0.1628 0.1619
va: 1.2678 1.2440 2.1290 2.0466 2.0651 3.1095 3.7493 3.8632 3.8330 3.9079 3.9064 3.8999 4.1774 4.2084 3.6992 3.6263 4.0832 4.0549 3.9690 3.7755 3.9035 3.9067 3.6756 4.0061 3.9083 3.8815 3.8835 3.8943 1.0497 1.0315 0.9995 1.0000 1.0172 1.0051 1.0006 1.0012 1.0169 1.0152 1.0261 1.0016 0.9893 0.9937 1.0068 0.9954 0.9882 0.9891 0.9890
dispcorr: -0.022873756 hartree
energy: -2050.695916666692
dipole: 17.18252 -17.83521 -0.65269 -1.75356 1.45245 -0.30111 -1.94636 2.70957 0.76321
magnitude: 1.04841 au
magnitude: 2.66485 debye
