program: Orca
programVersion: 5.0.2
elementType: Cl Cl O O O N C C C C C C C C C C C C C C C C C C C C C C H H H H H H H H H H H H H H H H H H H
charge: 0
multiplicity: 1
keywords: wb97x-d3
keywords: def2-TZVPP
keywords: def2/J RIJCOSX
keywords: DEFGRID2
keywords: scfconv7
keywords: smallprint printgap noloewdin
keywords: NOSOSCF
formula: C22H19Cl2NO3
InChI: InChI=1/C22H19Cl2NO3/c1-22(2)17(12-19(23)24)20(22)21(26)28-18(13-25)14-7-6-10-16(11-14)27-15-8-4-3-5-9-15/h3-12,17-18,20H,1-2H3
47 atoms
Cl -3.355404 -0.295313 2.422657
Cl -4.847236 0.479244 0.079712
O  1.765394 -1.697181 -1.118197
O  1.335353 -1.978424 1.055553
O  2.096796 3.346312 -0.301886
N  4.395507 -1.484386 -3.087113
C  -1.2853 -3.318275 -0.117101
C  -1.587692 -1.94636 0.408507
C  -0.435127 -2.142209 -0.559194
C  -0.744601 -4.338101 0.853711
C  -2.165128 -3.925083 -1.182225
C  -2.743688 -1.169222 -0.053853
C  0.943214 -1.942526 -0.083394
C  -3.538476 -0.440581 0.717803
C  3.124452 -1.435117 -0.804008
C  3.33352 -0.091763 -0.14146
C  3.821548 -1.467586 -2.090476
C  2.589124 1.005503 -0.550156
C  4.292681 0.033114 0.853152
C  2.797694 2.229108 0.070458
C  4.511236 1.270992 1.439025
C  3.759155 2.372066 1.060277
C  0.740249 3.240233 -0.498792
C  -0.065696 2.4954 0.352633
C  0.190879 3.951341 -1.554526
C  -1.433894 2.464071 0.130835
C  -1.181413 3.913568 -1.76003
C  -1.998962 3.1647 -0.925598
H  -1.293069 -1.785186 1.439201
H  -0.606788 -1.817359 -1.578856
H  -0.072648 -5.034045 0.348957
H  -1.571682 -4.918712 1.264737
H  -0.210123 -3.897137 1.691653
H  -1.62746 -4.716494 -1.706109
H  -2.492046 -3.203112 -1.928715
H  -3.053903 -4.369687 -0.731488
H  -2.96496 -1.171519 -1.113844
H  3.548499 -2.229813 -0.180932
H  1.851635 0.91265 -1.338275
H  4.863256 -0.830461 1.169482
H  5.257866 1.376155 2.214163
H  3.913298 3.335183 1.529555
H  0.359132 1.950376 1.185563
H  0.8314 4.531405 -2.206274
H  -2.059485 1.89617 0.804508
H  -1.607888 4.468264 -2.584796
H  -3.067189 3.130212 -1.091788
elementType: Cl O N C H
totalener: -2050.67316254 hartree
nucrepener: 2875.95560138 hartree
electener: -4926.62876391 hartree
oneelecener: -8527.12817061 hartree
twoeener: 3600.49940670 hartree
cpcmener: -0.03690224 hartree
kineticenergy: 2044.47729254 hartree
xcener: -151.867385861253 hartree
chargesum: -0.0000000
charge: -0.062162 -0.061626 -0.286543 -0.463305 -0.343337 -0.100896 0.083730 0.048608 -0.070212 -0.266483 -0.262696 -0.206586 0.397619 0.036187 0.422637 0.005109 -0.221555 -0.163144 -0.198775 0.211995 -0.124234 -0.217327 0.281133 -0.181628 -0.250286 -0.153107 -0.123959 -0.187714 0.082737 0.101430 0.103334 0.099576 0.093050 0.099301 0.091873 0.101007 0.135772 0.149033 0.151959 0.149769 0.162460 0.152460 0.153537 0.148145 0.172514 0.160734 0.149863
qa: -0.0622 -0.0616 -0.2865 -0.4633 -0.3433 -0.1009 0.0837 0.0486 -0.0702 -0.2665 -0.2627 -0.2066 0.3976 0.0362 0.4226 0.0051 -0.2216 -0.1631 -0.1988 0.2120 -0.1242 -0.2173 0.2811 -0.1816 -0.2503 -0.1531 -0.1240 -0.1877 0.0827 0.1014 0.1033 0.0996 0.0930 0.0993 0.0919 0.1010 0.1358 0.1490 0.1520 0.1498 0.1625 0.1525 0.1535 0.1481 0.1725 0.1607 0.1499
va: 1.2616 1.2407 2.1247 2.0414 2.0609 3.1095 3.7692 3.8359 3.8411 3.9034 3.9102 3.8896 4.1536 4.1904 3.6990 3.6064 4.0839 3.9212 3.9723 3.7736 3.8960 4.0014 3.6816 3.8991 4.0123 3.8392 3.9169 3.9182 1.0465 1.0325 0.9991 1.0002 1.0177 1.0011 1.0055 1.0011 1.0174 1.0150 1.0134 1.0009 0.9880 1.0025 1.0030 1.0069 0.9839 0.9882 1.0012
dispcorr: -0.027144106 hartree
energy: -2050.700306642993
dipole: 10.77516 -11.71124 -0.93608 -12.41948 11.32898 -1.09050 -5.42001 5.82671 0.40670
magnitude: 1.49360 au
magnitude: 3.79642 debye
