program: Orca
programVersion: 5.0.2
elementType: Cl Cl O O O N C C C C C C C C C C C C C C C C C C C C C C H H H H H H H H H H H H H H H H H H H
charge: 0
multiplicity: 1
keywords: wb97x-d3
keywords: def2-TZVPP
keywords: def2/J RIJCOSX
keywords: DEFGRID2
keywords: scfconv7
keywords: smallprint printgap noloewdin
keywords: NOSOSCF
formula: C22H19Cl2NO3
InChI: InChI=1/C22H19Cl2NO3/c1-22(2)17(12-19(23)24)20(22)21(26)28-18(13-25)14-7-6-10-16(11-14)27-15-8-4-3-5-9-15/h3-12,17-18,20H,1-2H3
47 atoms
Cl -3.072699 -3.553085 -3.371461
Cl -4.068548 -5.536401 -1.529993
O  1.636272 -1.651389 0.735177
O  1.026003 -1.188397 -1.36177
O  0.4603 3.063618 1.615158
N  4.254519 -2.148588 -1.358299
C  -1.785461 -1.187371 0.153529
C  -1.672847 -2.31177 -0.837819
C  -0.572157 -2.102445 0.176423
C  -1.677549 0.222297 -0.372675
C  -2.724229 -1.30845 1.327993
C  -2.499159 -3.520861 -0.734609
C  0.738159 -1.6078 -0.269655
C  -3.123868 -4.112689 -1.744741
C  2.864335 -0.975478 0.52216
C  2.678073 0.515408 0.319346
C  3.620502 -1.616169 -0.559622
C  1.699399 1.158145 1.067502
C  3.479234 1.243842 -0.547776
C  1.49751 2.520962 0.909968
C  3.279375 2.610925 -0.676745
C  2.284214 3.260241 0.034919
C  0.515499 4.37886 2.013125
C  1.622969 4.889254 2.678537
C  -0.602225 5.164764 1.781534
C  1.604152 6.20801 3.107055
C  -0.611998 6.478822 2.227948
C  0.490129 7.006905 2.884645
H  -1.428745 -1.995903 -1.84573
H  -0.535152 -2.785639 1.017555
H  -1.284952 0.893513 0.39323
H  -2.67083 0.582124 -0.645812
H  -1.047518 0.307248 -1.255503
H  -2.740342 -2.306593 1.76268
H  -3.742093 -1.055615 1.026589
H  -2.428797 -0.613347 2.115003
H  -2.610836 -3.976117 0.24215
H  3.434529 -1.148132 1.439542
H  1.075116 0.615339 1.766162
H  4.252636 0.76373 -1.132643
H  3.897482 3.178283 -1.359166
H  2.125099 4.321625 -0.101646
H  2.490146 4.268378 2.864059
H  -1.457621 4.750078 1.264235
H  2.466264 6.609158 3.623281
H  -1.485379 7.092509 2.052961
H  0.481237 8.033088 3.225714
elementType: Cl O N C H
totalener: -2050.67151226 hartree
nucrepener: 2733.35638798 hartree
electener: -4784.02790024 hartree
oneelecener: -8242.43996681 hartree
twoeener: 3458.41206657 hartree
cpcmener: -0.04012446 hartree
kineticenergy: 2044.46299417 hartree
xcener: -151.867216157178 hartree
chargesum: -0.0000000
charge: -0.056740 -0.061367 -0.291307 -0.448323 -0.338427 -0.093793 0.096182 0.024882 -0.049822 -0.267360 -0.264536 -0.204547 0.373758 0.037776 0.515020 -0.006902 -0.249534 -0.345194 -0.206268 0.322506 -0.120345 -0.204512 0.257929 -0.179980 -0.233997 -0.154646 -0.135988 -0.174232 0.080126 0.103722 0.089503 0.109083 0.098065 0.093013 0.102245 0.099333 0.135434 0.150311 0.143808 0.134845 0.163628 0.159557 0.160318 0.150893 0.162572 0.161513 0.161793
qa: -0.0567 -0.0614 -0.2913 -0.4483 -0.3384 -0.0938 0.0962 0.0249 -0.0498 -0.2674 -0.2645 -0.2045 0.3738 0.0378 0.5150 -0.0069 -0.2495 -0.3452 -0.2063 0.3225 -0.1203 -0.2045 0.2579 -0.1800 -0.2340 -0.1546 -0.1360 -0.1742 0.0801 0.1037 0.0895 0.1091 0.0981 0.0930 0.1022 0.0993 0.1354 0.1503 0.1438 0.1348 0.1636 0.1596 0.1603 0.1509 0.1626 0.1615 0.1618
va: 1.2689 1.2440 2.1285 2.0524 2.0434 3.1057 3.7266 3.9072 3.8379 3.8935 3.9031 3.8922 4.1776 4.2060 3.7741 3.7153 4.1134 4.0543 3.9581 3.6688 3.9231 3.9430 3.7017 3.9164 3.9969 3.8932 3.8849 3.8871 1.0481 1.0318 1.0075 1.0020 1.0144 1.0050 1.0009 1.0020 1.0154 0.9882 1.0226 1.0163 0.9898 0.9956 0.9953 1.0043 0.9891 0.9886 0.9890
dispcorr: -0.025042890 hartree
energy: -2050.696555148020
dipole: 8.93844 -9.56083 -0.62239 37.94007 -35.83270 2.10737 21.97455 -19.00051 2.97404
magnitude: 3.69774 au
magnitude: 9.39891 debye
