program: Orca
programVersion: 5.0.2
elementType: Cl Cl O O O N C C C C C C C C C C C C C C C C C C C C C C H H H H H H H H H H H H H H H H H H H
charge: 0
multiplicity: 1
keywords: wb97x-d3
keywords: def2-TZVPP
keywords: def2/J RIJCOSX
keywords: DEFGRID2
keywords: scfconv7
keywords: smallprint printgap noloewdin
keywords: NOSOSCF
formula: C22H19Cl2NO3
InChI: InChI=1/C22H19Cl2NO3/c1-22(2)17(12-19(23)24)20(22)21(26)28-18(13-25)14-7-6-10-16(11-14)27-15-8-4-3-5-9-15/h3-12,17-18,20H,1-2H3
47 atoms
Cl -3.742424 -1.931572 2.331896
Cl -5.399451 -1.262237 0.069444
O  1.707686 -1.811731 -1.062763
O  1.104516 -2.185752 1.057194
O  1.551679 3.259623 -1.122995
N  4.585149 -1.459893 -2.65373
C  -1.004777 -3.988429 -0.554451
C  -1.643002 -2.838121 0.170489
C  -0.45002 -2.586715 -0.726387
C  -0.260077 -5.007788 0.270029
C  -1.67585 -4.581612 -1.767901
C  -2.948513 -2.295668 -0.221623
C  0.829132 -2.187228 -0.115827
C  -3.892249 -1.889196 0.617809
C  2.96834 -1.344047 -0.604111
C  2.905757 0.072433 -0.083562
C  3.856623 -1.416415 -1.764862
C  2.222893 1.04274 -0.805275
C  3.542451 0.39408 1.105366
C  2.191863 2.34636 -0.33343
C  3.510029 1.704634 1.55977
C  2.842526 2.688063 0.847575
C  0.934111 4.356902 -0.572723
C  1.076662 5.560066 -1.247839
C  0.142733 4.268494 0.565797
C  0.419511 6.687997 -0.776717
C  -0.496238 5.408165 1.033331
C  -0.362255 6.619729 0.368103
H  -1.423486 -2.803731 1.231354
H  -0.646107 -2.1377 -1.693508
H  0.557834 -5.444528 -0.305552
H  -0.936828 -5.817345 0.547977
H  0.152499 -4.59957 1.190415
H  -2.448553 -5.290718 -1.4665
H  -0.946262 -5.122727 -2.372072
H  -2.137824 -3.832616 -2.409525
H  -3.16756 -2.21056 -1.279115
H  3.383323 -2.007897 0.161293
H  1.721074 0.799743 -1.734641
H  4.06339 -0.369395 1.668459
H  4.012389 1.967485 2.480822
H  2.837598 3.706709 1.212459
H  1.690091 5.610573 -2.138399
H  0.018144 3.326796 1.085298
H  0.528112 7.624997 -1.306767
H  -1.109046 5.342289 1.922713
H  -0.866775 7.502426 0.737478
elementType: Cl O N C H
totalener: -2050.67298066 hartree
nucrepener: 2705.49616807 hartree
electener: -4756.16914873 hartree
oneelecener: -8186.52427471 hartree
twoeener: 3430.35512598 hartree
cpcmener: -0.03732290 hartree
kineticenergy: 2044.45686082 hartree
xcener: -151.861920774958 hartree
chargesum: 0.0000000
charge: -0.057142 -0.061484 -0.286285 -0.460715 -0.335107 -0.101735 0.086905 0.024426 -0.075865 -0.259802 -0.264216 -0.201845 0.398923 0.040802 0.421290 0.008945 -0.220020 -0.241605 -0.198713 0.265816 -0.133155 -0.190456 0.295413 -0.252825 -0.202858 -0.124266 -0.144899 -0.186951 0.076894 0.104171 0.102173 0.100195 0.092118 0.101570 0.099138 0.093136 0.133531 0.145818 0.138560 0.150061 0.164362 0.160799 0.148738 0.160551 0.161097 0.162831 0.161682
qa: -0.0571 -0.0615 -0.2863 -0.4607 -0.3351 -0.1017 0.0869 0.0244 -0.0759 -0.2598 -0.2642 -0.2018 0.3989 0.0408 0.4213 0.0089 -0.2200 -0.2416 -0.1987 0.2658 -0.1332 -0.1905 0.2954 -0.2528 -0.2029 -0.1243 -0.1449 -0.1870 0.0769 0.1042 0.1022 0.1002 0.0921 0.1016 0.0991 0.0931 0.1335 0.1458 0.1386 0.1501 0.1644 0.1608 0.1487 0.1606 0.1611 0.1628 0.1617
va: 1.2686 1.2437 2.1265 2.0486 2.0700 3.1098 3.7587 3.8700 3.8219 3.9071 3.9061 3.9005 4.1887 4.2073 3.6981 3.6315 4.0832 4.0530 3.9736 3.7677 3.9026 3.9128 3.6638 4.0096 3.9148 3.8792 3.8809 3.8980 1.0514 1.0298 1.0000 1.0002 1.0160 1.0008 1.0014 1.0052 1.0173 1.0168 1.0265 1.0015 0.9893 0.9937 1.0072 0.9954 0.9882 0.9889 0.9891
dispcorr: -0.022743990 hartree
energy: -2050.695724647023
dipole: 17.60976 -18.25874 -0.64898 0.48709 -0.57476 -0.08766 -5.23940 5.82653 0.58713
magnitude: 0.87953 au
magnitude: 2.23560 debye
