program: Orca
programVersion: 5.0.2
elementType: Cl Cl O O O N C C C C C C C C C C C C C C C C C C C C C C H H H H H H H H H H H H H H H H H H H
charge: 0
multiplicity: 1
keywords: wb97x-d3
keywords: def2-TZVPP
keywords: def2/J RIJCOSX
keywords: DEFGRID2
keywords: scfconv7
keywords: smallprint printgap noloewdin
keywords: NOSOSCF
formula: C22H19Cl2NO3
InChI: InChI=1/C22H19Cl2NO3/c1-22(2)17(12-19(23)24)20(22)21(26)28-18(13-25)14-7-6-10-16(11-14)27-15-8-4-3-5-9-15/h3-12,17-18,20H,1-2H3
47 atoms
Cl -1.070453 -5.265688 -1.543636
Cl -3.799425 -5.638442 -0.686507
O  0.768538 -1.001989 0.353192
O  -0.45149 0.46112 1.523708
O  2.268788 4.468255 0.367579
N  3.812558 -2.242345 0.638761
C  -1.814992 -0.891286 -1.428343
C  -1.546828 -2.241754 -0.821712
C  -1.574423 -1.015173 0.063892
C  -0.752097 -0.310947 -2.329299
C  -3.212888 -0.50419 -1.841874
C  -2.611688 -3.238604 -0.652704
C  -0.388791 -0.440317 0.723408
C  -2.501094 -4.531808 -0.927551
C  1.971022 -0.39948 0.831416
C  2.320685 0.823867 0.020524
C  2.99279 -1.439711 0.714405
C  2.177367 2.072787 0.604985
C  2.708249 0.70577 -1.310248
C  2.391734 3.211647 -0.160349
C  2.948033 1.851111 -2.051631
C  2.779666 3.107779 -1.487225
C  1.246451 4.734965 1.247484
C  1.532551 5.586198 2.304568
C  -0.034713 4.22523 1.070354
C  0.524686 5.93154 3.193803
C  -1.028421 4.569763 1.975337
C  -0.756446 5.420304 3.038787
H  -0.564948 -2.6423 -1.041455
H  -2.465519 -0.881107 0.667124
H  -0.70147 0.774393 -2.224623
H  -1.000552 -0.529768 -3.368826
H  0.238845 -0.718411 -2.143605
H  -3.295311 0.582055 -1.903169
H  -3.976916 -0.850059 -1.147185
H  -3.443898 -0.91007 -2.82808
H  -3.565954 -2.899261 -0.267263
H  1.888797 -0.146261 1.89242
H  1.891447 2.152002 1.646171
H  2.822464 -0.268184 -1.769935
H  3.25368 1.769249 -3.085819
H  2.950221 4.001599 -2.073357
H  2.534513 5.977187 2.42738
H  -0.26503 3.569064 0.240484
H  0.749256 6.597223 4.016697
H  -2.02545 4.171379 1.840369
H  -1.537776 5.684811 3.738431
elementType: Cl O N C H
totalener: -2050.67056767 hartree
nucrepener: 2772.28314391 hartree
electener: -4822.95371158 hartree
oneelecener: -8319.63615259 hartree
twoeener: 3496.68244101 hartree
cpcmener: -0.03740768 hartree
kineticenergy: 2044.45649879 hartree
xcener: -151.862757252582 hartree
chargesum: -0.0000000
charge: -0.058060 -0.061337 -0.266110 -0.467874 -0.340000 -0.100296 0.102036 0.047175 -0.102426 -0.278186 -0.269257 -0.219787 0.430190 0.042413 0.379575 0.046555 -0.215594 -0.183153 -0.275320 0.278069 -0.109898 -0.226710 0.291364 -0.253298 -0.194787 -0.124691 -0.149894 -0.187248 0.087852 0.103847 0.103925 0.103071 0.093709 0.100067 0.092086 0.100590 0.134241 0.141508 0.148620 0.149909 0.162818 0.150796 0.148760 0.159698 0.161118 0.162468 0.161466
qa: -0.0581 -0.0613 -0.2661 -0.4679 -0.3400 -0.1003 0.1020 0.0472 -0.1024 -0.2782 -0.2693 -0.2198 0.4302 0.0424 0.3796 0.0466 -0.2156 -0.1832 -0.2753 0.2781 -0.1099 -0.2267 0.2914 -0.2533 -0.1948 -0.1247 -0.1499 -0.1872 0.0879 0.1038 0.1039 0.1031 0.0937 0.1001 0.0921 0.1006 0.1342 0.1415 0.1486 0.1499 0.1628 0.1508 0.1488 0.1597 0.1611 0.1625 0.1615
va: 1.2673 1.2440 2.1394 2.0267 2.0689 3.1078 3.7171 3.8517 3.8683 3.9111 3.9070 3.8863 4.1585 4.2094 3.7601 3.5385 4.0664 3.9369 3.9722 3.7234 3.8897 4.0306 3.6700 4.0062 3.8857 3.8778 3.8921 3.9010 1.0363 1.0285 0.9980 1.0024 1.0070 1.0001 1.0052 1.0012 1.0168 1.0170 1.0122 1.0045 0.9878 1.0034 1.0071 0.9995 0.9879 0.9902 0.9890
dispcorr: -0.025907414 hartree
energy: -2050.696475085339
dipole: 0.33558 -1.91164 -1.57607 38.63333 -37.02347 1.60986 -1.79258 1.04803 -0.74455
magnitude: 2.37276 au
magnitude: 6.03108 debye
