program: Orca
programVersion: 5.0.2
elementType: Cl Cl O O O N C C C C C C C C C C C C C C C C C C C C C C H H H H H H H H H H H H H H H H H H H
charge: 0
multiplicity: 1
keywords: wb97x-d3
keywords: def2-TZVPP
keywords: def2/J RIJCOSX
keywords: DEFGRID2
keywords: scfconv7
keywords: smallprint printgap noloewdin
keywords: NOSOSCF
formula: C22H19Cl2NO3
InChI: InChI=1/C22H19Cl2NO3/c1-22(2)17(12-19(23)24)20(22)21(26)28-18(13-25)14-7-6-10-16(11-14)27-15-8-4-3-5-9-15/h3-12,17-18,20H,1-2H3
47 atoms
Cl -1.432522 0.491028 2.377108
Cl -3.987085 0.916502 1.100243
O  1.399856 -1.986817 -1.107655
O  1.48299 -2.722249 1.001231
O  0.904229 2.790866 0.583899
N  3.546069 -1.025946 -3.418822
C  -1.469208 -3.694409 0.495879
C  -1.491712 -2.298154 1.021726
C  -0.608416 -2.648795 -0.178007
C  -0.859787 -4.766015 1.364958
C  -2.620157 -4.197843 -0.341865
C  -2.604263 -1.36141 0.816998
C  0.839075 -2.49382 0.008286
C  -2.665578 -0.153631 1.363799
C  2.730404 -1.51413 -0.983977
C  2.818347 -0.243427 -0.164317
C  3.17031 -1.248457 -2.354889
C  1.779724 0.678839 -0.200623
C  3.95637 -0.00519 0.591227
C  1.897313 1.854583 0.528572
C  4.058079 1.175683 1.312295
C  3.036612 2.110466 1.281738
C  0.06346 2.973227 -0.488506
C  -1.28984 3.111389 -0.219738
C  0.547772 3.08115 -1.78653
C  -2.169487 3.356595 -1.265342
C  -0.344091 3.316407 -2.822406
C  -1.703172 3.453686 -2.568768
H  -0.933005 -2.158062 1.940501
H  -0.972116 -2.310714 -1.140829
H  -1.645211 -5.235958 1.95867
H  -0.111656 -4.387102 2.056672
H  -0.39838 -5.543506 0.754465
H  -3.445342 -4.51886 0.295596
H  -2.302219 -5.057663 -0.93294
H  -3.001002 -3.450136 -1.036572
H  -3.4224 -1.654855 0.170621
H  3.395914 -2.278133 -0.568579
H  0.890235 0.484368 -0.786682
H  4.755394 -0.735205 0.616584
H  4.942084 1.3718 1.903777
H  3.115797 3.03226 1.843444
H  -1.650166 3.037697 0.797794
H  1.606467 2.985833 -1.992984
H  -3.225515 3.464351 -1.05538
H  0.030503 3.398868 -3.834281
H  -2.392179 3.638781 -3.381856
elementType: Cl O N C H
totalener: -2050.67067755 hartree
nucrepener: 2943.38491553 hartree
electener: -4994.05559308 hartree
oneelecener: -8662.72429234 hartree
twoeener: 3668.66869926 hartree
cpcmener: -0.03622367 hartree
kineticenergy: 2044.46147570 hartree
xcener: -151.865350714929 hartree
chargesum: -0.0000000
charge: -0.058513 -0.056992 -0.293120 -0.461202 -0.333494 -0.100746 0.126753 -0.047914 -0.050498 -0.267745 -0.283960 -0.159037 0.375366 0.047567 0.421304 0.019246 -0.223650 -0.199503 -0.221798 0.267847 -0.108302 -0.247564 0.308202 -0.273125 -0.197776 -0.113097 -0.141257 -0.191550 0.098760 0.102647 0.097594 0.092943 0.101996 0.106435 0.101227 0.092942 0.135305 0.149461 0.144693 0.148778 0.162617 0.150023 0.142842 0.156958 0.155612 0.162757 0.160969
qa: -0.0585 -0.0570 -0.2931 -0.4612 -0.3335 -0.1007 0.1268 -0.0479 -0.0505 -0.2677 -0.2840 -0.1590 0.3754 0.0476 0.4213 0.0192 -0.2237 -0.1995 -0.2218 0.2678 -0.1083 -0.2476 0.3082 -0.2731 -0.1978 -0.1131 -0.1413 -0.1916 0.0988 0.1026 0.0976 0.0929 0.1020 0.1064 0.1012 0.0929 0.1353 0.1495 0.1447 0.1488 0.1626 0.1500 0.1428 0.1570 0.1556 0.1628 0.1610
va: 1.2713 1.2505 2.1072 2.0440 2.0630 3.1102 3.8024 3.9048 3.7976 3.8854 3.9162 3.9019 4.1809 4.1738 3.7092 3.6377 4.0764 3.9328 3.9910 3.6998 3.8875 4.0172 3.6735 3.9763 3.9207 3.8866 3.8784 3.9339 1.0395 1.0320 1.0003 1.0187 0.9994 0.9991 1.0012 1.0026 1.0175 1.0152 1.0186 1.0012 0.9875 1.0052 1.0267 0.9972 0.9961 0.9885 0.9895
dispcorr: -0.028052746 hartree
energy: -2050.698730300459
dipole: 2.94507 -4.13075 -1.18568 -16.66002 15.51977 -1.14025 -7.85363 8.14428 0.29065
magnitude: 1.67047 au
magnitude: 4.24601 debye
