program: Orca
programVersion: 5.0.2
elementType: Cl Cl O O O N C C C C C C C C C C C C C C C C C C C C C C H H H H H H H H H H H H H H H H H H H
charge: 0
multiplicity: 1
keywords: wb97x-d3
keywords: def2-TZVPP
keywords: def2/J RIJCOSX
keywords: DEFGRID2
keywords: scfconv7
keywords: smallprint printgap noloewdin
keywords: NOSOSCF
formula: C22H19Cl2NO3
InChI: InChI=1/C22H19Cl2NO3/c1-22(2)17(12-19(23)24)20(22)21(26)28-18(13-25)14-7-6-10-16(11-14)27-15-8-4-3-5-9-15/h3-12,17-18,20H,1-2H3
47 atoms
Cl -3.855229 -2.795358 2.424029
Cl -5.565041 -1.749688 0.350343
O  1.568606 -1.664526 -1.110832
O  1.069276 -2.201429 1.002162
O  1.652237 3.466177 -1.238152
N  4.368441 -1.225033 -2.808118
C  -1.006812 -3.972277 -0.72246
C  -1.676612 -2.957544 0.162447
C  -0.546147 -2.527928 -0.742321
C  -0.166307 -5.029549 -0.05331
C  -1.701011 -4.463307 -1.96763
C  -3.027525 -2.457582 -0.120362
C  0.745507 -2.128902 -0.156061
C  -4.005418 -2.348311 0.76869
C  2.84168 -1.187338 -0.687143
C  2.762195 0.211634 -0.126677
C  3.680653 -1.216153 -1.88667
C  2.215568 1.22551 -0.902345
C  3.219035 0.472896 1.156539
C  2.143809 2.51338 -0.393148
C  3.139809 1.766152 1.652794
C  2.60744 2.792795 0.888348
C  1.104375 4.623941 -0.734423
C  1.606826 5.828688 -1.199418
C  0.039156 4.587209 0.155598
C  1.02765 7.016011 -0.772044
C  -0.522576 5.781283 0.58283
C  -0.03323 6.996981 0.121974
H  -1.418238 -3.042079 1.211599
H  -0.817392 -1.979875 -1.637763
H  0.639447 -5.356445 -0.712638
H  -0.783897 -5.900596 0.168909
H  0.276127 -4.697525 0.883378
H  -2.407373 -5.257374 -1.720871
H  -0.969862 -4.874201 -2.665121
H  -2.245691 -3.678731 -2.489862
H  -3.251705 -2.147749 -1.134031
H  3.297107 -1.864712 0.042028
H  1.85489 1.027754 -1.905416
H  3.637687 -0.321911 1.759828
H  3.499895 1.98259 2.649358
H  2.566795 3.796005 1.291588
H  2.437021 5.836948 -1.894223
H  -0.353488 3.64128 0.506927
H  1.414704 7.958022 -1.137061
H  -1.35444 5.758414 1.274428
H  -0.480721 7.923918 0.454141
elementType: Cl O N C H
totalener: -2050.67291209 hartree
nucrepener: 2682.59890714 hartree
electener: -4733.27181923 hartree
oneelecener: -8140.70813260 hartree
twoeener: 3407.43631337 hartree
cpcmener: -0.03693636 hartree
kineticenergy: 2044.46806511 hartree
xcener: -151.862607892101 hartree
chargesum: -0.0000000
charge: -0.057570 -0.061386 -0.282307 -0.461986 -0.334342 -0.101458 0.086627 0.029421 -0.090915 -0.260450 -0.259454 -0.200226 0.407842 0.034346 0.421338 0.004207 -0.220279 -0.242566 -0.193145 0.255839 -0.142677 -0.178970 0.254988 -0.225563 -0.179716 -0.135977 -0.150546 -0.171885 0.078103 0.103757 0.102368 0.100265 0.092746 0.101767 0.099040 0.091642 0.136206 0.143916 0.137464 0.151628 0.163758 0.157977 0.149403 0.161358 0.160663 0.162746 0.162007
qa: -0.0576 -0.0614 -0.2823 -0.4620 -0.3343 -0.1015 0.0866 0.0294 -0.0909 -0.2605 -0.2595 -0.2002 0.4078 0.0343 0.4213 0.0042 -0.2203 -0.2426 -0.1931 0.2558 -0.1427 -0.1790 0.2550 -0.2256 -0.1797 -0.1360 -0.1505 -0.1719 0.0781 0.1038 0.1024 0.1003 0.0927 0.1018 0.0990 0.0916 0.1362 0.1439 0.1375 0.1516 0.1638 0.1580 0.1494 0.1614 0.1607 0.1627 0.1620
va: 1.2679 1.2440 2.1337 2.0488 2.0643 3.1092 3.7571 3.8628 3.8351 3.9087 3.9022 3.8888 4.1878 4.2079 3.7091 3.6302 4.0843 4.0656 3.9517 3.7858 3.9184 3.8995 3.6903 4.0017 3.9257 3.8836 3.8829 3.8863 1.0495 1.0314 1.0001 1.0005 1.0156 1.0011 1.0018 1.0049 1.0147 1.0152 1.0262 1.0034 0.9899 0.9969 1.0055 0.9945 0.9887 0.9890 0.9889
dispcorr: -0.022761558 hartree
energy: -2050.695673647116
dipole: 18.84309 -19.48433 -0.64124 4.94333 -4.69052 0.25281 -7.50278 8.05977 0.55698
magnitude: 0.88619 au
magnitude: 2.25251 debye
