program: Orca
programVersion: 5.0.2
elementType: Cl Cl O O O N C C C C C C C C C C C C C C C C C C C C C C H H H H H H H H H H H H H H H H H H H
charge: 0
multiplicity: 1
keywords: wb97x-d3
keywords: def2-TZVPP
keywords: def2/J RIJCOSX
keywords: DEFGRID2
keywords: scfconv7
keywords: smallprint printgap noloewdin
keywords: NOSOSCF
formula: C22H19Cl2NO3
InChI: InChI=1/C22H19Cl2NO3/c1-22(2)17(12-19(23)24)20(22)21(26)28-18(13-25)14-7-6-10-16(11-14)27-15-8-4-3-5-9-15/h3-12,17-18,20H,1-2H3
47 atoms
Cl -3.775057 -1.305098 -2.022721
Cl -4.796682 -3.989199 -1.76434
O  1.036206 -1.182119 -0.741803
O  2.164196 -2.795128 0.314151
O  1.869286 3.119938 2.16834
N  1.72723 0.950202 -3.157132
C  -1.099921 -2.167697 1.389434
C  -1.522802 -2.264028 -0.052805
C  -0.199417 -2.851196 0.380901
C  -0.746514 -0.799802 1.918885
C  -1.735882 -3.059738 2.426406
C  -2.58883 -3.177105 -0.484152
C  1.112764 -2.294896 -0.002157
C  -3.577483 -2.860347 -1.310478
C  2.265677 -0.545999 -1.083337
C  2.812608 0.27917 0.054572
C  1.948636 0.292097 -2.240364
C  2.063784 1.340114 0.551011
C  4.041011 -0.044104 0.612237
C  2.566085 2.086143 1.606507
C  4.523731 0.705504 1.675808
C  3.795271 1.77299 2.173132
C  1.116265 3.950854 1.372668
C  1.594389 4.439568 0.163092
C  -0.124401 4.337376 1.856401
C  0.808589 5.319227 -0.56691
C  -0.893919 5.228095 1.120626
C  -0.434475 5.718844 -0.093549
H  -1.46644 -1.3287 -0.595985
H  -0.158075 -3.930344 0.482298
H  0.045839 -0.864106 2.666822
H  -1.619984 -0.358997 2.401963
H  -0.424741 -0.10829 1.142681
H  -2.695235 -2.648457 2.745026
H  -1.094986 -3.125827 3.307012
H  -1.906137 -4.074763 2.070181
H  -2.575526 -4.190986 -0.101919
H  3.008639 -1.279495 -1.411218
H  1.099993 1.580302 0.116642
H  4.61691 -0.871973 0.220311
H  5.48002 0.461002 2.117743
H  4.174247 2.362262 2.998153
H  2.567347 4.145832 -0.210186
H  -0.481746 3.948541 2.801339
H  1.178801 5.700176 -1.509526
H  -1.860467 5.533057 1.499457
H  -1.038955 6.409068 -0.666491
elementType: Cl O N C H
totalener: -2050.67088225 hartree
nucrepener: 2787.31991316 hartree
electener: -4837.99079541 hartree
oneelecener: -8349.96205770 hartree
twoeener: 3511.97126229 hartree
cpcmener: -0.03762126 hartree
kineticenergy: 2044.45638324 hartree
xcener: -151.862044350157 hartree
chargesum: 0.0000000
charge: -0.058361 -0.061411 -0.271422 -0.462424 -0.340693 -0.100123 0.094012 0.054007 -0.107521 -0.265847 -0.269458 -0.224060 0.423208 0.043730 0.396007 0.077941 -0.223906 -0.281101 -0.199449 0.267373 -0.116910 -0.235108 0.287448 -0.189266 -0.252613 -0.145803 -0.123201 -0.187730 0.085268 0.106283 0.105676 0.103541 0.086788 0.100500 0.099516 0.092488 0.135491 0.145238 0.156106 0.150250 0.163022 0.151542 0.157288 0.148960 0.162253 0.161296 0.161172
qa: -0.0584 -0.0614 -0.2714 -0.4624 -0.3407 -0.1001 0.0940 0.0540 -0.1075 -0.2658 -0.2695 -0.2241 0.4232 0.0437 0.3960 0.0779 -0.2239 -0.2811 -0.1994 0.2674 -0.1169 -0.2351 0.2874 -0.1893 -0.2526 -0.1458 -0.1232 -0.1877 0.0853 0.1063 0.1057 0.1035 0.0868 0.1005 0.0995 0.0925 0.1355 0.1452 0.1561 0.1502 0.1630 0.1515 0.1573 0.1490 0.1623 0.1613 0.1612
va: 1.2670 1.2444 2.1429 2.0406 2.0645 3.1073 3.7432 3.8375 3.8693 3.9128 3.9042 3.8880 4.1802 4.2065 3.7513 3.5215 4.0809 3.9419 3.9647 3.7351 3.8993 4.0177 3.6753 3.9000 4.0058 3.8842 3.8758 3.8979 1.0368 1.0274 1.0000 1.0013 1.0046 1.0008 1.0008 1.0050 1.0160 1.0144 0.9997 1.0058 0.9878 1.0037 0.9975 1.0072 0.9892 0.9879 0.9893
dispcorr: -0.025427324 hartree
energy: -2050.696309576026
dipole: 18.11817 -17.83574 0.28243 13.84354 -14.22378 -0.38024 23.65675 -21.87688 1.77988
magnitude: 1.84182 au
magnitude: 4.68154 debye
