program: Orca
programVersion: 5.0.2
elementType: Cl Cl O O O N C C C C C C C C C C C C C C C C C C C C C C H H H H H H H H H H H H H H H H H H H
charge: 0
multiplicity: 1
keywords: wb97x-d3
keywords: def2-TZVPP
keywords: def2/J RIJCOSX
keywords: DEFGRID2
keywords: scfconv7
keywords: smallprint printgap noloewdin
keywords: NOSOSCF
formula: C22H19Cl2NO3
InChI: InChI=1/C22H19Cl2NO3/c1-22(2)17(12-19(23)24)20(22)21(26)28-18(13-25)14-7-6-10-16(11-14)27-15-8-4-3-5-9-15/h3-12,17-18,20H,1-2H3
47 atoms
Cl -2.517708 -5.605517 2.126027
Cl -4.937765 -4.040778 2.22387
O  0.732494 -0.861511 -0.278488
O  1.297822 -3.020083 -0.337701
O  1.031647 4.13347 -0.846753
N  3.564792 -0.915114 -2.119596
C  -1.514959 -3.403564 -1.646315
C  -1.664934 -3.625228 -0.171406
C  -0.986952 -2.361359 -0.68062
C  -0.579735 -4.318062 -2.397945
C  -2.707224 -2.981617 -2.470975
C  -2.955552 -3.487421 0.512303
C  0.447216 -2.168782 -0.422561
C  -3.398472 -4.272645 1.485803
C  2.083193 -0.521199 0.003068
C  2.133018 0.927922 0.412479
C  2.905105 -0.754341 -1.190733
C  1.591877 1.90478 -0.413505
C  2.726479 1.271745 1.618565
C  1.63154 3.232499 -0.01425
C  2.766787 2.605112 1.99955
C  2.218826 3.591256 1.195365
C  1.414556 5.456131 -0.796697
C  2.717763 5.825975 -1.099406
C  0.453175 6.405024 -0.490058
C  3.056006 7.17085 -1.091254
C  0.803219 7.74908 -0.493093
C  2.102844 8.135308 -0.788277
H  -0.988252 -4.364811 0.241411
H  -1.57686 -1.454311 -0.622044
H  -0.10264 -3.792676 -3.226581
H  -1.153865 -5.14448 -2.8196
H  0.198475 -4.749221 -1.773809
H  -3.327588 -3.84644 -2.711134
H  -2.371957 -2.542913 -3.41167
H  -3.334705 -2.243836 -1.973662
H  -3.607537 -2.678646 0.204805
H  2.486961 -1.143337 0.80712
H  1.137294 1.645579 -1.362728
H  3.148967 0.506773 2.256868
H  3.221457 2.882248 2.940999
H  2.246029 4.62343 1.518909
H  3.458969 5.074942 -1.343191
H  -0.558114 6.097431 -0.256591
H  4.069726 7.465037 -1.328857
H  0.054939 8.494063 -0.256999
H  2.372268 9.182942 -0.786746
elementType: Cl O N C H
totalener: -2050.67381488 hartree
nucrepener: 2619.88688467 hartree
electener: -4670.56069956 hartree
oneelecener: -8015.32197096 hartree
twoeener: 3344.76127141 hartree
cpcmener: -0.03824527 hartree
kineticenergy: 2044.45424601 hartree
xcener: -151.860152844593 hartree
chargesum: 0.0000000
charge: -0.056749 -0.060480 -0.285945 -0.468467 -0.336503 -0.102362 0.090683 0.030998 -0.083950 -0.271099 -0.265032 -0.198625 0.421387 0.038607 0.446313 -0.007436 -0.233627 -0.233062 -0.182555 0.238010 -0.153421 -0.169293 0.236892 -0.168663 -0.213414 -0.154818 -0.141857 -0.165976 0.084095 0.099791 0.101729 0.098889 0.094311 0.100921 0.099496 0.093619 0.134182 0.130435 0.140869 0.151298 0.163968 0.158563 0.161816 0.150082 0.162408 0.161502 0.162472
qa: -0.0567 -0.0605 -0.2859 -0.4685 -0.3365 -0.1024 0.0907 0.0310 -0.0839 -0.2711 -0.2650 -0.1986 0.4214 0.0386 0.4463 -0.0074 -0.2336 -0.2331 -0.1826 0.2380 -0.1534 -0.1693 0.2369 -0.1687 -0.2134 -0.1548 -0.1419 -0.1660 0.0841 0.0998 0.1017 0.0989 0.0943 0.1009 0.0995 0.0936 0.1342 0.1304 0.1409 0.1513 0.1640 0.1586 0.1618 0.1501 0.1624 0.1615 0.1625
va: 1.2689 1.2444 2.1680 2.0368 2.0599 3.1080 3.7227 3.8795 3.8750 3.9030 3.9094 3.8961 4.1372 4.2098 3.6956 3.7615 4.0295 4.0746 3.9349 3.7987 3.9264 3.8854 3.7074 3.9256 3.9931 3.8858 3.8837 3.8809 1.0432 1.0312 0.9996 0.9998 1.0189 1.0008 1.0010 1.0054 1.0168 1.0221 1.0264 1.0007 0.9904 0.9968 0.9943 1.0044 0.9892 0.9886 0.9887
dispcorr: -0.022044962 hartree
energy: -2050.695859846449
dipole: 14.26974 -15.28337 -1.01362 26.81354 -24.73556 2.07798 -19.05260 19.95164 0.89904
magnitude: 2.48067 au
magnitude: 6.30535 debye
