program: Orca
programVersion: 5.0.2
elementType: Cl Cl O O O N C C C C C C C C C C C C C C C C C C C C C C H H H H H H H H H H H H H H H H H H H
charge: 0
multiplicity: 1
keywords: wb97x-d3
keywords: def2-TZVPP
keywords: def2/J RIJCOSX
keywords: DEFGRID2
keywords: scfconv7
keywords: smallprint printgap noloewdin
keywords: NOSOSCF
formula: C22H19Cl2NO3
InChI: InChI=1/C22H19Cl2NO3/c1-22(2)17(12-19(23)24)20(22)21(26)28-18(13-25)14-7-6-10-16(11-14)27-15-8-4-3-5-9-15/h3-12,17-18,20H,1-2H3
47 atoms
Cl -3.005625 -2.701115 -2.902093
Cl -4.319906 -4.795266 -1.415738
O  1.003789 -1.0041 -0.501958
O  1.762835 -2.230081 1.199295
O  2.173721 3.395261 1.976463
N  2.200291 0.457564 -3.193626
C  -1.668125 -1.04214 1.063358
C  -1.696938 -1.94889 -0.132981
C  -0.575502 -2.079899 0.883674
C  -1.406162 0.426724 0.831202
C  -2.608499 -1.285179 2.219281
C  -2.643779 -3.064125 -0.251422
C  0.833097 -1.790828 0.566895
C  -3.237572 -3.455484 -1.371867
C  2.341214 -0.649405 -0.830717
C  2.962647 0.309748 0.157373
C  2.244624 -0.029031 -2.152756
C  2.243262 1.427151 0.566389
C  4.237529 0.064258 0.640582
C  2.817881 2.301635 1.476754
C  4.801139 0.954319 1.54559
C  4.100273 2.070501 1.965511
C  1.079419 3.91839 1.32526
C  -0.097122 4.04998 2.044918
C  1.170521 4.364251 0.013923
C  -1.195269 4.652563 1.445414
C  0.061672 4.951095 -0.577235
C  -1.121458 5.100847 0.134819
H  -1.424837 -1.46789 -1.064702
H  -0.654108 -2.920854 1.563385
H  -0.880379 0.634179 -0.097515
H  -0.831746 0.854437 1.654833
H  -2.359079 0.95658 0.787176
H  -3.59268 -0.867345 2.001295
H  -2.230551 -0.792712 3.116426
H  -2.735324 -2.340443 2.456567
H  -2.871536 -3.631721 0.642983
H  2.968938 -1.54028 -0.934962
H  1.24717 1.60346 0.179989
H  4.784564 -0.811803 0.317528
H  5.795708 0.774652 1.930875
H  4.537966 2.760805 2.675204
H  -0.149385 3.69667 3.066458
H  2.09561 4.261988 -0.539367
H  -2.112093 4.766043 2.008211
H  0.128793 5.302718 -1.597964
H  -1.97955 5.568273 -0.329273
elementType: Cl O N C H
totalener: -2050.67061396 hartree
nucrepener: 2807.55636980 hartree
electener: -4858.22698377 hartree
oneelecener: -8390.27746791 hartree
twoeener: 3532.05048414 hartree
cpcmener: -0.03842094 hartree
kineticenergy: 2044.46255066 hartree
xcener: -151.864634714265 hartree
chargesum: 0.0000000
charge: -0.057432 -0.061467 -0.272554 -0.462435 -0.335185 -0.098852 0.118342 0.050770 -0.096077 -0.308709 -0.269835 -0.218305 0.419152 0.042691 0.372584 0.012356 -0.218198 -0.228826 -0.224844 0.311677 -0.099571 -0.255181 0.309759 -0.274459 -0.193651 -0.122410 -0.144097 -0.173459 0.089136 0.098707 0.098866 0.108701 0.104725 0.100996 0.100035 0.093427 0.132576 0.149051 0.147546 0.149281 0.162258 0.150062 0.149174 0.157650 0.161555 0.163175 0.161294
qa: -0.0574 -0.0615 -0.2726 -0.4624 -0.3352 -0.0989 0.1183 0.0508 -0.0961 -0.3087 -0.2698 -0.2183 0.4192 0.0427 0.3726 0.0124 -0.2182 -0.2288 -0.2248 0.3117 -0.0996 -0.2552 0.3098 -0.2745 -0.1937 -0.1224 -0.1441 -0.1735 0.0891 0.0987 0.0989 0.1087 0.1047 0.1010 0.1000 0.0934 0.1326 0.1491 0.1475 0.1493 0.1623 0.1501 0.1492 0.1577 0.1616 0.1632 0.1613
va: 1.2680 1.2436 2.1369 2.0413 2.0808 3.1071 3.7167 3.8545 3.8681 3.9085 3.9093 3.8894 4.1737 4.2128 3.7727 3.6289 4.0792 3.9554 3.9768 3.7094 3.8823 4.0002 3.6167 3.9875 3.9207 3.8509 3.8794 3.8954 1.0370 1.0296 1.0085 0.9941 1.0025 1.0009 1.0006 1.0058 1.0191 1.0133 1.0058 1.0014 0.9875 1.0061 1.0074 0.9972 0.9878 0.9886 0.9890
dispcorr: -0.026396924 hartree
energy: -2050.697010888694
dipole: 9.60790 -10.16627 -0.55836 26.15075 -25.75692 0.39383 22.48465 -20.78515 1.69950
magnitude: 1.83171 au
magnitude: 4.65583 debye
