program: Orca
programVersion: 5.0.2
elementType: Cl Cl O O O N C C C C C C C C C C C C C C C C C C C C C C H H H H H H H H H H H H H H H H H H H
charge: 0
multiplicity: 1
keywords: wb97x-d3
keywords: def2-TZVPP
keywords: def2/J RIJCOSX
keywords: DEFGRID2
keywords: scfconv7
keywords: smallprint printgap noloewdin
keywords: NOSOSCF
formula: C22H19Cl2NO3
InChI: InChI=1/C22H19Cl2NO3/c1-22(2)17(12-19(23)24)20(22)21(26)28-18(13-25)14-7-6-10-16(11-14)27-15-8-4-3-5-9-15/h3-12,17-18,20H,1-2H3
47 atoms
Cl -3.302974 -2.278278 -2.830074
Cl -4.447667 -4.653098 -1.660096
O  0.980368 -1.016512 -0.642731
O  1.954874 -2.446263 0.767359
O  2.121275 3.267829 2.149016
N  1.843079 0.90643 -3.167177
C  -1.474309 -1.480246 1.20706
C  -1.646857 -2.101867 -0.150247
C  -0.405476 -2.410164 0.665591
C  -1.24901 0.011259 1.271789
C  -2.256608 -2.003168 2.387494
C  -2.602585 -3.190448 -0.387368
C  0.951013 -1.976986 0.288062
C  -3.342162 -3.344047 -1.478272
C  2.259597 -0.511918 -1.011878
C  2.887229 0.353857 0.055127
C  2.012195 0.276418 -2.220148
C  2.1714 1.427048 0.575658
C  4.168164 0.068815 0.500906
C  2.760805 2.222545 1.547172
C  4.742289 0.873103 1.475982
C  4.048078 1.949765 1.998502
C  1.11073 3.944602 1.507716
C  1.251101 4.414122 0.207827
C  -0.036448 4.20873 2.240482
C  0.218153 5.146653 -0.359453
C  -1.055577 4.95501 1.664771
C  -0.935905 5.420983 0.363233
H  -1.504749 -1.417951 -0.978161
H  -0.3845 -3.382928 1.143902
H  -0.560406 0.268492 2.07859
H  -2.198027 0.507974 1.48022
H  -0.863943 0.432641 0.346348
H  -1.76873 -1.705607 3.317034
H  -2.342137 -3.088783 2.398144
H  -3.264179 -1.584338 2.392703
H  -2.717885 -3.939006 0.387526
H  2.93857 -1.326265 -1.284287
H  1.168303 1.634447 0.222968
H  4.713109 -0.771849 0.091998
H  5.741111 0.66024 1.832069
H  4.495791 2.57802 2.757814
H  2.152013 4.216698 -0.359467
H  -0.126251 3.841862 3.254898
H  0.32311 5.511497 -1.372699
H  -1.947803 5.1667 2.23904
H  -1.734132 5.997558 -0.084498
elementType: Cl O N C H
totalener: -2050.67061263 hartree
nucrepener: 2791.25692820 hartree
electener: -4841.92754082 hartree
oneelecener: -8357.75254729 hartree
twoeener: 3515.82500646 hartree
cpcmener: -0.03819030 hartree
kineticenergy: 2044.44671838 hartree
xcener: -151.861408708469 hartree
chargesum: -0.0000000
charge: -0.057815 -0.061704 -0.272214 -0.463274 -0.335357 -0.099834 0.111768 0.049469 -0.098167 -0.291639 -0.271672 -0.220185 0.422511 0.044042 0.384953 0.036749 -0.221237 -0.264509 -0.213668 0.299298 -0.105554 -0.250667 0.312980 -0.206701 -0.270416 -0.139449 -0.117124 -0.186936 0.088421 0.100275 0.106844 0.103972 0.091976 0.100545 0.093167 0.100864 0.132469 0.147384 0.164223 0.150184 0.162478 0.150718 0.157877 0.148182 0.163085 0.161721 0.161966
qa: -0.0578 -0.0617 -0.2722 -0.4633 -0.3354 -0.0998 0.1118 0.0495 -0.0982 -0.2916 -0.2717 -0.2202 0.4225 0.0440 0.3850 0.0367 -0.2212 -0.2645 -0.2137 0.2993 -0.1056 -0.2507 0.3130 -0.2067 -0.2704 -0.1394 -0.1171 -0.1869 0.0884 0.1003 0.1068 0.1040 0.0920 0.1005 0.0932 0.1009 0.1325 0.1474 0.1642 0.1502 0.1625 0.1507 0.1579 0.1482 0.1631 0.1617 0.1620
va: 1.2678 1.2434 2.1401 2.0414 2.0784 3.1059 3.7168 3.8534 3.8674 3.9081 3.9117 3.8866 4.1731 4.2109 3.7668 3.5827 4.0800 3.9652 3.9664 3.7262 3.8881 4.0065 3.6368 3.9151 4.0027 3.8768 3.8663 3.9035 1.0348 1.0290 0.9956 1.0022 1.0107 1.0000 1.0060 1.0009 1.0190 1.0131 0.9858 1.0025 0.9877 1.0053 0.9971 1.0079 0.9886 0.9877 0.9891
dispcorr: -0.025739632 hartree
energy: -2050.696352260008
dipole: 12.58098 -12.77776 -0.19678 22.18096 -22.12685 0.05412 24.63585 -22.87254 1.76331
magnitude: 1.77509 au
magnitude: 4.51191 debye
