program: Orca
programVersion: 5.0.2
elementType: Cl Cl O O O N C C C C C C C C C C C C C C C C C C C C C C H H H H H H H H H H H H H H H H H H H
charge: 0
multiplicity: 1
keywords: wb97x-d3
keywords: def2-TZVPP
keywords: def2/J RIJCOSX
keywords: DEFGRID2
keywords: scfconv7
keywords: smallprint printgap noloewdin
keywords: NOSOSCF
formula: C22H19Cl2NO3
InChI: InChI=1/C22H19Cl2NO3/c1-22(2)17(12-19(23)24)20(22)21(26)28-18(13-25)14-7-6-10-16(11-14)27-15-8-4-3-5-9-15/h3-12,17-18,20H,1-2H3
47 atoms
Cl -2.384149 -5.597021 2.102467
Cl -4.817599 -4.065395 2.332588
O  0.706478 -0.801781 -0.321901
O  1.275454 -2.951917 -0.499241
O  0.891065 4.202916 -0.653577
N  3.477162 -0.757075 -2.260292
C  -1.590658 -3.30769 -1.683487
C  -1.669292 -3.577153 -0.211151
C  -1.023676 -2.292013 -0.712419
C  -0.68414 -4.184059 -2.512588
C  -2.825733 -2.873383 -2.435796
C  -2.926905 -3.467073 0.536142
C  0.419331 -2.102551 -0.510765
C  -3.312189 -4.269415 1.520374
C  2.065275 -0.467803 -0.074771
C  2.120452 0.963666 0.391211
C  2.848338 -0.645898 -1.303648
C  1.517644 1.965434 -0.359981
C  2.777803 1.267419 1.573976
C  1.556701 3.273523 0.096145
C  2.815893 2.583715 2.012642
C  2.202472 3.59134 1.287411
C  1.339633 5.503781 -0.67053
C  2.667378 5.804222 -0.945644
C  0.409156 6.508673 -0.45868
C  3.062403 7.13268 -0.994315
C  0.816461 7.834785 -0.52203
C  2.142193 8.151655 -0.782044
H  -0.968702 -4.322635 0.147523
H  -1.613569 -1.390706 -0.596486
H  -0.230363 -3.615069 -3.325714
H  -1.275884 -4.983431 -2.961464
H  0.110703 -4.652071 -1.937792
H  -3.454906 -3.736388 -2.659936
H  -2.541856 -2.415157 -3.384345
H  -3.429367 -2.147939 -1.892612
H  -3.603607 -2.663637 0.271039
H  2.498841 -1.119544 0.689236
H  1.014557 1.739503 -1.29306
H  3.250101 0.48427 2.152492
H  3.318922 2.828211 2.93845
H  2.226011 4.609132 1.654383
H  3.387119 5.014488 -1.121872
H  -0.622665 6.256696 -0.249622
H  4.096671 7.370222 -1.205275
H  0.091611 8.621151 -0.35794
H  2.4571 9.185804 -0.822521
elementType: Cl O N C H
totalener: -2050.67369991 hartree
nucrepener: 2622.25225384 hartree
electener: -4672.92595376 hartree
oneelecener: -8020.00954065 hartree
twoeener: 3347.08358689 hartree
cpcmener: -0.03825877 hartree
kineticenergy: 2044.45721519 hartree
xcener: -151.861003867055 hartree
chargesum: -0.0000000
charge: -0.056604 -0.060647 -0.286052 -0.468256 -0.337934 -0.101627 0.091418 0.031889 -0.080056 -0.272178 -0.266506 -0.199575 0.419236 0.038826 0.445012 -0.005639 -0.234071 -0.231832 -0.180442 0.231190 -0.147529 -0.167001 0.259039 -0.177653 -0.231973 -0.150782 -0.134063 -0.176235 0.084013 0.099913 0.102610 0.098693 0.094338 0.101240 0.099568 0.093356 0.133774 0.130575 0.140999 0.150528 0.163919 0.160169 0.161470 0.149267 0.162256 0.161400 0.161958
qa: -0.0566 -0.0606 -0.2861 -0.4683 -0.3379 -0.1016 0.0914 0.0319 -0.0801 -0.2722 -0.2665 -0.1996 0.4192 0.0388 0.4450 -0.0056 -0.2341 -0.2318 -0.1804 0.2312 -0.1475 -0.1670 0.2590 -0.1777 -0.2320 -0.1508 -0.1341 -0.1762 0.0840 0.0999 0.1026 0.0987 0.0943 0.1012 0.0996 0.0934 0.1338 0.1306 0.1410 0.1505 0.1639 0.1602 0.1615 0.1493 0.1623 0.1614 0.1620
va: 1.2689 1.2443 2.1675 2.0371 2.0599 3.1083 3.7208 3.8793 3.8726 3.9027 3.9114 3.8951 4.1376 4.2107 3.6986 3.7544 4.0288 4.0761 3.9386 3.8012 3.9162 3.8941 3.6902 3.9099 4.0013 3.8839 3.8822 3.8886 1.0432 1.0308 0.9993 0.9999 1.0184 1.0004 1.0009 1.0056 1.0171 1.0222 1.0264 1.0010 0.9903 0.9943 0.9944 1.0058 0.9893 0.9883 0.9890
dispcorr: -0.022040698 hartree
energy: -2050.695740612383
dipole: 13.38111 -14.33753 -0.95642 27.16761 -25.25350 1.91411 -19.32501 20.29979 0.97478
magnitude: 2.35133 au
magnitude: 5.97660 debye
