program: Orca
programVersion: 5.0.2
elementType: Cl Cl O O O N C C C C C C C C C C C C C C C C C C C C C C H H H H H H H H H H H H H H H H H H H
charge: 0
multiplicity: 1
keywords: wb97x-d3
keywords: def2-TZVPP
keywords: def2/J RIJCOSX
keywords: DEFGRID2
keywords: scfconv7
keywords: smallprint printgap noloewdin
keywords: NOSOSCF
formula: C22H19Cl2NO3
InChI: InChI=1/C22H19Cl2NO3/c1-22(2)17(12-19(23)24)20(22)21(26)28-18(13-25)14-7-6-10-16(11-14)27-15-8-4-3-5-9-15/h3-12,17-18,20H,1-2H3
47 atoms
Cl -3.776548 -0.160727 -1.705836
Cl -3.900537 -2.156333 -3.783488
O  1.802789 -1.937784 0.233416
O  0.261182 -0.744462 1.331227
O  2.000179 3.800863 0.452862
N  5.065035 -2.306064 0.27664
C  -1.555673 -3.237911 0.748026
C  -1.822165 -2.178249 -0.277905
C  -0.392425 -2.624801 -0.006263
C  -1.818114 -2.894701 2.192951
C  -1.83929 -4.686108 0.429885
C  -2.412346 -2.486265 -1.584864
C  0.54008 -1.66496 0.604035
C  -3.247524 -1.703211 -2.255525
C  2.817346 -1.035386 0.67273
C  2.773163 0.261256 -0.099016
C  4.0711 -1.753574 0.446853
C  2.447436 1.430046 0.572673
C  2.990452 0.268142 -1.47221
C  2.30347 2.609283 -0.145585
C  2.870224 1.458893 -2.170755
C  2.51436 2.629085 -1.516894
C  1.131953 3.858154 1.515389
C  1.386017 4.83724 2.466439
C  0.016474 3.035874 1.624106
C  0.518226 4.99252 3.537303
C  -0.834496 3.194493 2.709563
C  -0.591232 4.168241 3.668981
H  -2.07288 -1.207728 0.135103
H  0.054031 -3.269923 -0.75374
H  -1.735136 -1.832705 2.408587
H  -1.13301 -3.432348 2.850292
H  -2.83222 -3.201155 2.453611
H  -2.899224 -4.906023 0.566889
H  -1.276071 -5.33135 1.105384
H  -1.566275 -4.965246 -0.586606
H  -2.148115 -3.426948 -2.052134
H  2.73935 -0.845476 1.747834
H  2.296692 1.409149 1.644533
H  3.25079 -0.642544 -1.997624
H  3.040645 1.477739 -3.238619
H  2.403938 3.554736 -2.067002
H  2.254481 5.475473 2.363517
H  -0.197765 2.279448 0.879985
H  0.718736 5.759397 4.273864
H  -1.699977 2.550977 2.798169
H  -1.262054 4.285379 4.50938
elementType: Cl O N C H
totalener: -2050.67218763 hartree
nucrepener: 2776.40700958 hartree
electener: -4827.07919721 hartree
oneelecener: -8328.30045229 hartree
twoeener: 3501.22125508 hartree
cpcmener: -0.03550330 hartree
kineticenergy: 2044.45311625 hartree
xcener: -151.861590928648 hartree
chargesum: 0.0000000
charge: -0.057278 -0.061307 -0.277686 -0.474891 -0.336471 -0.101599 0.095315 0.018753 -0.074225 -0.269159 -0.270120 -0.198076 0.421325 0.040272 0.413870 0.013848 -0.217371 -0.209912 -0.227648 0.303417 -0.123042 -0.237782 0.313335 -0.266554 -0.210304 -0.116477 -0.140977 -0.195986 0.085920 0.099173 0.094103 0.101438 0.098257 0.102063 0.099041 0.093606 0.132193 0.140690 0.150937 0.148302 0.163195 0.150279 0.148235 0.153960 0.161591 0.162393 0.161354
qa: -0.0573 -0.0613 -0.2777 -0.4749 -0.3365 -0.1016 0.0953 0.0188 -0.0742 -0.2692 -0.2701 -0.1981 0.4213 0.0403 0.4139 0.0138 -0.2174 -0.2099 -0.2276 0.3034 -0.1230 -0.2378 0.3133 -0.2666 -0.2103 -0.1165 -0.1410 -0.1960 0.0859 0.0992 0.0941 0.1014 0.0983 0.1021 0.0990 0.0936 0.1322 0.1407 0.1509 0.1483 0.1632 0.1503 0.1482 0.1540 0.1616 0.1624 0.1614
va: 1.2682 1.2439 2.1415 2.0300 2.0782 3.1087 3.7290 3.8850 3.8504 3.9036 3.9105 3.9010 4.1345 4.2099 3.7305 3.5823 4.0670 3.9322 3.9889 3.7045 3.9001 4.0224 3.6669 4.0109 3.9041 3.8729 3.8829 3.9102 1.0390 1.0323 1.0181 0.9993 0.9998 1.0005 1.0009 1.0054 1.0185 1.0149 1.0075 1.0082 0.9881 1.0048 1.0082 1.0057 0.9876 0.9896 0.9894
dispcorr: -0.023962729 hartree
energy: -2050.696150356112
dipole: 8.30081 -9.50898 -1.20817 -2.72979 2.01979 -0.70999 23.43210 -22.93919 0.49291
magnitude: 1.48551 au
magnitude: 3.77586 debye
