program: Orca
programVersion: 5.0.2
elementType: Cl Cl O O O N C C C C C C C C C C C C C C C C C C C C C C H H H H H H H H H H H H H H H H H H H
charge: 0
multiplicity: 1
keywords: wb97x-d3
keywords: def2-TZVPP
keywords: def2/J RIJCOSX
keywords: DEFGRID2
keywords: scfconv7
keywords: smallprint printgap noloewdin
keywords: NOSOSCF
formula: C22H19Cl2NO3
InChI: InChI=1/C22H19Cl2NO3/c1-22(2)17(12-19(23)24)20(22)21(26)28-18(13-25)14-7-6-10-16(11-14)27-15-8-4-3-5-9-15/h3-12,17-18,20H,1-2H3
47 atoms
Cl -3.91789 -0.250546 1.859054
Cl -4.964376 0.409563 -0.746933
O  1.899423 -1.790569 -0.902286
O  1.235567 -1.58617 1.224525
O  1.958807 3.226052 -0.504769
N  4.730539 -2.219161 -2.543316
C  -1.284149 -3.108253 0.028136
C  -1.606524 -1.663218 0.279045
C  -0.367108 -2.025161 -0.509842
C  -0.869906 -3.95152 1.207205
C  -2.06524 -3.876446 -1.008813
C  -2.704666 -0.990096 -0.429878
C  0.963114 -1.778635 0.066887
C  -3.719281 -0.367201 0.153466
C  3.234963 -1.526796 -0.515032
C  3.492004 -0.071364 -0.178419
C  4.053268 -1.919537 -1.663611
C  2.593688 0.913231 -0.553666
C  4.655335 0.257135 0.508079
C  2.842032 2.228399 -0.182618
C  4.913514 1.581967 0.819928
C  4.001051 2.575157 0.491583
C  0.623505 3.039759 -0.237603
C  0.178389 2.307764 0.857583
C  -0.279718 3.65976 -1.089061
C  -1.18526 2.196378 1.087171
C  -1.640504 3.54675 -0.839683
C  -2.100857 2.811161 0.243702
H  -1.426383 -1.329385 1.29522
H  -0.422102 -1.879228 -1.582742
H  -0.167234 -4.727867 0.900066
H  -1.748353 -4.448366 1.621693
H  -0.413552 -3.376266 2.009459
H  -3.012926 -4.221368 -0.592173
H  -1.502211 -4.75559 -1.325771
H  -2.283553 -3.287844 -1.898925
H  -2.694482 -1.00431 -1.51328
H  3.53488 -2.158139 0.32899
H  1.697652 0.677555 -1.114134
H  5.35392 -0.517581 0.79925
H  5.820513 1.843745 1.348009
H  4.184266 3.606628 0.763145
H  0.875953 1.826322 1.531095
H  0.079785 4.227995 -1.937601
H  -1.528435 1.626371 1.940499
H  -2.342935 4.032279 -1.50435
H  -3.162415 2.723533 0.432165
elementType: Cl O N C H
totalener: -2050.67268658 hartree
nucrepener: 2897.07229124 hartree
electener: -4947.74497782 hartree
oneelecener: -8569.36141974 hartree
twoeener: 3621.61644192 hartree
cpcmener: -0.03670024 hartree
kineticenergy: 2044.45027593 hartree
xcener: -151.864406039766 hartree
chargesum: -0.0000000
charge: -0.057917 -0.060169 -0.287096 -0.456698 -0.341506 -0.098867 0.100104 -0.000220 -0.051041 -0.268366 -0.259381 -0.179090 0.373369 0.024787 0.404920 0.030510 -0.218475 -0.176896 -0.222603 0.227948 -0.119744 -0.220737 0.303216 -0.199007 -0.257825 -0.157601 -0.119186 -0.163639 0.091367 0.101365 0.103498 0.099520 0.093275 0.101923 0.100505 0.091950 0.138885 0.151452 0.155322 0.151694 0.163455 0.151057 0.151159 0.148151 0.155356 0.160242 0.141037
qa: -0.0579 -0.0602 -0.2871 -0.4567 -0.3415 -0.0989 0.1001 -0.0002 -0.0510 -0.2684 -0.2594 -0.1791 0.3734 0.0248 0.4049 0.0305 -0.2185 -0.1769 -0.2226 0.2279 -0.1197 -0.2207 0.3032 -0.1990 -0.2578 -0.1576 -0.1192 -0.1636 0.0914 0.1014 0.1035 0.0995 0.0933 0.1019 0.1005 0.0919 0.1389 0.1515 0.1553 0.1517 0.1635 0.1511 0.1512 0.1482 0.1554 0.1602 0.1410
va: 1.2655 1.2454 2.1174 2.0394 2.0677 3.1128 3.7916 3.8498 3.8474 3.9037 3.9061 3.8367 4.1560 4.2038 3.7071 3.6086 4.0695 3.9439 3.9924 3.7641 3.8855 4.0133 3.6594 3.9034 4.0212 3.8451 3.9223 3.8407 1.0354 1.0336 0.9996 1.0004 1.0168 1.0012 1.0021 1.0037 1.0124 1.0144 1.0087 0.9999 0.9874 1.0026 1.0052 1.0070 1.0007 0.9884 1.0116
dispcorr: -0.028594225 hartree
energy: -2050.701280805393
dipole: 12.86516 -13.61295 -0.74779 -10.93694 10.14992 -0.78702 0.45328 0.08445 0.53773
magnitude: 1.21150 au
magnitude: 3.07940 debye
