program: Orca
programVersion: 5.0.2
elementType: Cl Cl O O O N C C C C C C C C C C C C C C C C C C C C C C H H H H H H H H H H H H H H H H H H H
charge: 0
multiplicity: 1
keywords: wb97x-d3
keywords: def2-TZVPP
keywords: def2/J RIJCOSX
keywords: DEFGRID2
keywords: scfconv7
keywords: smallprint printgap noloewdin
keywords: NOSOSCF
formula: C22H19Cl2NO3
InChI: InChI=1/C22H19Cl2NO3/c1-22(2)17(12-19(23)24)20(22)21(26)28-18(13-25)14-7-6-10-16(11-14)27-15-8-4-3-5-9-15/h3-12,17-18,20H,1-2H3
47 atoms
Cl -4.044265 -0.70595 -2.015017
Cl -3.813041 -2.868329 -3.908207
O  1.667759 -1.84239 0.315473
O  0.028182 -0.610789 1.206761
O  2.110472 4.008705 0.489311
N  4.958659 -1.966763 0.349562
C  -1.649239 -3.239705 0.813838
C  -1.912368 -2.322693 -0.342996
C  -0.480392 -2.652781 0.04845
C  -2.005521 -2.741972 2.192483
C  -1.845583 -4.728386 0.658719
C  -2.406268 -2.817716 -1.632724
C  0.376995 -1.589277 0.594668
C  -3.300369 -2.209291 -2.401465
C  2.618349 -0.867886 0.73104
C  2.511106 0.411682 -0.064595
C  3.920906 -1.498947 0.51501
C  2.380155 1.614122 0.611001
C  2.513577 0.371904 -1.454034
C  2.224658 2.787133 -0.115791
C  2.372894 1.55326 -2.164333
C  2.218112 2.762603 -1.50248
C  1.397952 4.136776 1.657158
C  1.884799 5.041833 2.589094
C  0.214625 3.445463 1.888225
C  1.177865 5.258663 3.763195
C  -0.474861 3.664921 3.072171
C  -0.000154 4.568638 4.013393
H  -2.240115 -1.328216 -0.061837
H  0.035648 -3.353142 -0.597953
H  -2.008199 -1.658127 2.273913
H  -1.31725 -3.139946 2.939753
H  -3.007032 -3.089841 2.449748
H  -2.901323 -4.985631 0.758723
H  -1.299872 -5.258017 1.440895
H  -1.49478 -5.110996 -0.298472
H  -2.008966 -3.756423 -1.999789
H  2.527686 -0.661171 1.802393
H  2.387618 1.626567 1.693888
H  2.61995 -0.567939 -1.981093
H  2.370551 1.534895 -3.245734
H  2.093744 3.682695 -2.05883
H  2.806857 5.574585 2.393896
H  -0.173519 2.742334 1.161917
H  1.558414 5.96629 4.487993
H  -1.394786 3.124717 3.253543
H  -0.545506 4.734375 4.932719
elementType: Cl O N C H
totalener: -2050.67228820 hartree
nucrepener: 2746.74502501 hartree
electener: -4797.41731321 hartree
oneelecener: -8268.96869778 hartree
twoeener: 3471.55138457 hartree
cpcmener: -0.03676779 hartree
kineticenergy: 2044.45671531 hartree
xcener: -151.862186022027 hartree
chargesum: 0.0000000
charge: -0.056791 -0.061099 -0.280417 -0.468663 -0.339093 -0.101878 0.094501 0.026212 -0.073051 -0.271005 -0.265828 -0.200569 0.408281 0.039612 0.420431 0.018580 -0.216973 -0.204572 -0.232609 0.287283 -0.126491 -0.228988 0.298083 -0.258234 -0.193840 -0.120727 -0.145094 -0.192821 0.083037 0.098229 0.094067 0.102353 0.098492 0.101825 0.098871 0.092701 0.133321 0.142345 0.149817 0.150274 0.162726 0.151079 0.147996 0.153870 0.161020 0.162715 0.161023
qa: -0.0568 -0.0611 -0.2804 -0.4687 -0.3391 -0.1019 0.0945 0.0262 -0.0731 -0.2710 -0.2658 -0.2006 0.4083 0.0396 0.4204 0.0186 -0.2170 -0.2046 -0.2326 0.2873 -0.1265 -0.2290 0.2981 -0.2582 -0.1938 -0.1207 -0.1451 -0.1928 0.0830 0.0982 0.0941 0.1024 0.0985 0.1018 0.0989 0.0927 0.1333 0.1423 0.1498 0.1503 0.1627 0.1511 0.1480 0.1539 0.1610 0.1627 0.1610
va: 1.2689 1.2439 2.1356 2.0372 2.0706 3.1085 3.7281 3.8770 3.8528 3.9048 3.9102 3.8958 4.1456 4.2077 3.7143 3.5823 4.0800 3.9376 3.9761 3.7144 3.9049 4.0107 3.6732 4.0086 3.8994 3.8758 3.8863 3.9038 1.0437 1.0338 1.0186 0.9991 0.9999 1.0007 1.0010 1.0055 1.0173 1.0160 1.0042 1.0095 0.9880 1.0040 1.0076 1.0035 0.9879 0.9893 0.9894
dispcorr: -0.023609922 hartree
energy: -2050.695898120870
dipole: 9.09914 -10.29984 -1.20069 1.19607 -1.94643 -0.75036 25.82604 -25.08915 0.73689
magnitude: 1.59615 au
magnitude: 4.05710 debye
