program: Orca
programVersion: 5.0.2
elementType: Cl Cl O O O N C C C C C C C C C C C C C C C C C C C C C C H H H H H H H H H H H H H H H H H H H
charge: 0
multiplicity: 1
keywords: wb97x-d3
keywords: def2-TZVPP
keywords: def2/J RIJCOSX
keywords: DEFGRID2
keywords: scfconv7
keywords: smallprint printgap noloewdin
keywords: NOSOSCF
formula: C22H19Cl2NO3
InChI: InChI=1/C22H19Cl2NO3/c1-22(2)17(12-19(23)24)20(22)21(26)28-18(13-25)14-7-6-10-16(11-14)27-15-8-4-3-5-9-15/h3-12,17-18,20H,1-2H3
47 atoms
Cl 4.354036 -4.047996 -0.995291
Cl 3.315695 -6.645098 -0.294893
O  -0.902241 -1.016578 0.841417
O  0.929567 -0.372652 -0.272293
O  -1.521469 4.777654 -0.547402
N  -2.491096 0.097368 3.526024
C  0.148549 -2.88583 -2.02097
C  1.331508 -3.191251 -1.15029
C  0.081226 -2.599681 -0.533045
C  0.281634 -1.757034 -3.014466
C  -0.733956 -4.006779 -2.516115
C  1.71862 -4.563764 -0.801396
C  0.125228 -1.220504 -0.007829
C  2.964033 -5.015255 -0.713353
C  -1.030318 0.292209 1.367786
C  -1.683511 1.247856 0.394387
C  -1.850549 0.159639 2.574802
C  -1.267819 2.568672 0.373473
C  -2.70957 0.817142 -0.436561
C  -1.898794 3.474394 -0.471293
C  -3.306323 1.722392 -1.298755
C  -2.913752 3.051036 -1.31625
C  -1.212464 5.466291 0.592967
C  -0.180396 6.389471 0.514465
C  -1.925992 5.303099 1.774013
C  0.13949 7.152176 1.626945
C  -1.586431 6.064553 2.881508
C  -0.555343 6.989757 2.815827
H  2.15139 -2.488805 -1.246844
H  -0.550742 -3.272704 0.035414
H  0.974046 -0.983788 -2.691268
H  -0.685747 -1.285584 -3.198281
H  0.64385 -2.151724 -3.965163
H  -0.290718 -4.485131 -3.391055
H  -1.709238 -3.615506 -2.809194
H  -0.909299 -4.779979 -1.769074
H  0.934038 -5.279809 -0.590773
H  -0.053121 0.686844 1.667032
H  -0.454829 2.89513 1.010964
H  -3.043823 -0.211255 -0.413417
H  -4.102054 1.395218 -1.953989
H  -3.388509 3.763079 -1.977981
H  0.360361 6.508049 -0.414962
H  -2.741367 4.593801 1.834498
H  0.943589 7.872988 1.562489
H  -2.141085 5.934535 3.801176
H  -0.298177 7.581616 3.683467
totalener: -2050.66083011 hartree
nucrepener: 2670.01075785 hartree
electener: -4720.67158795 hartree
oneelecener: -8115.17111602 hartree
twoeener: 3394.49952807 hartree
kineticenergy: 2044.53557025 hartree
xcener: -151.871481421692 hartree
chargesum: -0.0000000
charge: -0.037731 -0.043689 -0.270991 -0.359007 -0.297976 0.000335 0.067413 0.040644 -0.082046 -0.239758 -0.246794 -0.204014 0.319410 0.052532 0.305616 0.080277 -0.251884 -0.163070 -0.199497 0.206091 -0.095600 -0.183177 0.242409 -0.212503 -0.165489 -0.087883 -0.115093 -0.146099 0.087219 0.083111 0.102548 0.084604 0.091640 0.100746 0.093008 0.074772 0.096725 0.124444 0.116807 0.126149 0.128235 0.130346 0.126746 0.135964 0.126255 0.131214 0.127039
qa: -0.0377 -0.0437 -0.2710 -0.3590 -0.2980 0.0003 0.0674 0.0406 -0.0820 -0.2398 -0.2468 -0.2040 0.3194 0.0525 0.3056 0.0803 -0.2519 -0.1631 -0.1995 0.2061 -0.0956 -0.1832 0.2424 -0.2125 -0.1655 -0.0879 -0.1151 -0.1461 0.0872 0.0831 0.1025 0.0846 0.0916 0.1007 0.0930 0.0748 0.0967 0.1244 0.1168 0.1261 0.1282 0.1303 0.1267 0.1360 0.1263 0.1312 0.1270
va: 1.2900 1.2613 2.1135 2.1455 2.1120 3.1219 3.7664 3.8420 3.8404 3.9125 3.9087 3.9246 4.2726 4.2534 3.8351 3.6413 4.0143 4.0022 4.0051 3.8810 3.9451 4.0346 3.8003 4.0385 3.9347 3.9320 3.9529 3.9637 1.0508 1.0349 1.0204 1.0040 1.0018 1.0025 1.0042 1.0099 1.0313 1.0223 1.0132 1.0189 0.9995 1.0104 1.0137 1.0034 0.9987 0.9992 1.0002
dispcorr: -0.023250638 hartree
energy: -2050.684080743883
dipole: -24.01120 23.64396 -0.36724 26.47743 -26.34977 0.12766 -8.43241 7.23571 -1.19670
magnitude: 1.25828 au
magnitude: 3.19828 debye
