program: Orca
programVersion: 5.0.2
elementType: Cl Cl O O O N C C C C C C C C C C C C C C C C C C C C C C H H H H H H H H H H H H H H H H H H H
charge: 0
multiplicity: 1
keywords: wb97x-d3
keywords: def2-TZVPP
keywords: def2/J RIJCOSX
keywords: DEFGRID2
keywords: scfconv7
keywords: smallprint printgap noloewdin
keywords: NOSOSCF
formula: C22H19Cl2NO3
InChI: InChI=1/C22H19Cl2NO3/c1-22(2)17(12-19(23)24)20(22)21(26)28-18(13-25)14-7-6-10-16(11-14)27-15-8-4-3-5-9-15/h3-12,17-18,20H,1-2H3
47 atoms
Cl 2.957304 -0.033531 0.040411
Cl 4.412041 -1.480828 2.071341
O  -1.573219 -1.417692 -0.595398
O  -2.579346 -2.489669 1.089394
O  -0.877923 3.687283 0.601227
N  -2.744821 -0.020044 -3.349143
C  0.43815 -3.758288 -0.459852
C  0.999075 -2.476648 0.083365
C  -0.319337 -3.006794 0.616039
C  -0.038082 -3.770706 -1.892884
C  1.030407 -5.081995 -0.03515
C  2.169705 -2.43384 0.967605
C  -1.604593 -2.301123 0.417385
C  3.057014 -1.447265 1.014221
C  -2.74821 -0.643085 -0.811217
C  -2.758733 0.585298 0.063567
C  -2.735076 -0.296877 -2.234391
C  -1.785997 1.564119 -0.122905
C  -3.706976 0.707244 1.064097
C  -1.780716 2.680575 0.69918
C  -3.690239 1.831267 1.88024
C  -2.738173 2.815011 1.703496
C  0.061146 3.662946 -0.398617
C  1.344525 3.230386 -0.106785
C  -0.270285 4.109658 -1.669102
C  2.312386 3.260522 -1.100593
C  0.70284 4.126858 -2.656395
C  1.99421 3.703789 -2.375692
H  0.907611 -1.63009 -0.585445
H  -0.290182 -3.475471 1.593235
H  0.773261 -4.103452 -2.541724
H  -0.359749 -2.796642 -2.251356
H  -0.867165 -4.468887 -2.020523
H  1.927394 -5.305568 -0.614212
H  0.314175 -5.886047 -0.207323
H  1.299258 -5.11523 1.019846
H  2.337059 -3.264188 1.642256
H  -3.643751 -1.241522 -0.619032
H  -1.047206 1.453773 -0.907466
H  -4.44352 -0.069754 1.217684
H  -4.427153 1.938371 2.664677
H  -2.722617 3.692871 2.335852
H  1.583332 2.884923 0.890568
H  -1.278066 4.444096 -1.879148
H  3.320378 2.938711 -0.873596
H  0.449065 4.47386 -3.649147
H  2.751244 3.724079 -3.147902
totalener: -2050.65951906 hartree
nucrepener: 2868.37943016 hartree
electener: -4919.03894922 hartree
oneelecener: -8512.11683034 hartree
twoeener: 3593.07788112 hartree
kineticenergy: 2044.53033496 hartree
xcener: -151.870683850407 hartree
chargesum: 0.0000000
charge: -0.051925 -0.044582 -0.272902 -0.349894 -0.294858 -0.000651 0.070954 0.063083 -0.086297 -0.246066 -0.260404 -0.225531 0.356055 0.071382 0.301252 -0.004877 -0.275005 -0.179899 -0.138955 0.248596 -0.080550 -0.205992 0.205107 -0.160269 -0.147060 -0.135601 -0.118963 -0.115215 0.084297 0.083660 0.089178 0.095907 0.093617 0.100239 0.096713 0.074986 0.097315 0.122291 0.118651 0.113679 0.126772 0.127050 0.128941 0.129708 0.137991 0.129285 0.128787
qa: -0.0519 -0.0446 -0.2729 -0.3499 -0.2949 -0.0007 0.0710 0.0631 -0.0863 -0.2461 -0.2604 -0.2255 0.3561 0.0714 0.3013 -0.0049 -0.2750 -0.1799 -0.1390 0.2486 -0.0806 -0.2060 0.2051 -0.1603 -0.1471 -0.1356 -0.1190 -0.1152 0.0843 0.0837 0.0892 0.0959 0.0936 0.1002 0.0967 0.0750 0.0973 0.1223 0.1187 0.1137 0.1268 0.1270 0.1289 0.1297 0.1380 0.1293 0.1288
va: 1.2924 1.2617 2.1118 2.1593 2.1212 3.1140 3.7514 3.7801 3.8461 3.9201 3.9215 3.9472 4.2629 4.2456 3.8635 3.7069 4.0177 3.9629 3.9976 3.8563 3.9529 4.0386 3.8484 3.9865 3.9992 3.8961 3.9568 3.9579 1.0411 1.0307 1.0027 1.0128 1.0015 1.0016 1.0033 1.0103 1.0322 1.0201 1.0263 1.0188 0.9995 1.0135 1.0177 1.0064 1.0024 0.9995 1.0001
dispcorr: -0.026055339 hartree
energy: -2050.685574399326
dipole: -13.84211 14.26977 0.42766 -9.60970 8.98358 -0.62612 -9.30000 9.75976 0.45976
magnitude: 0.88673 au
magnitude: 2.25390 debye
