program: Orca
programVersion: 5.0.2
elementType: Cl Cl O O O N C C C C C C C C C C C C C C C C C C C C C C H H H H H H H H H H H H H H H H H H H
charge: 0
multiplicity: 1
keywords: wb97x-d3
keywords: def2-TZVPP
keywords: def2/J RIJCOSX
keywords: DEFGRID2
keywords: scfconv7
keywords: smallprint printgap noloewdin
keywords: NOSOSCF
formula: C22H19Cl2NO3
InChI: InChI=1/C22H19Cl2NO3/c1-22(2)17(12-19(23)24)20(22)21(26)28-18(13-25)14-7-6-10-16(11-14)27-15-8-4-3-5-9-15/h3-12,17-18,20H,1-2H3
47 atoms
Cl 3.257029 -1.152823 -1.678024
Cl 4.803972 -0.445947 0.654281
O  -1.74657 -1.474894 -0.106886
O  -2.260263 -1.836976 2.037144
O  -1.212867 3.599826 0.157262
N  -3.467879 -1.071031 -2.892593
C  0.610964 -3.393387 0.503896
C  1.039938 -1.964619 0.325002
C  -0.050989 -2.295975 1.314661
C  -0.111695 -4.071603 -0.633933
C  1.50165 -4.333413 1.279542
C  2.33458 -1.465391 0.820612
C  -1.455002 -1.857694 1.150935
C  3.331082 -1.081686 0.033692
C  -3.042951 -0.937693 -0.317294
C  -3.148911 0.491322 0.161811
C  -3.267892 -1.016388 -1.762931
C  -2.095297 1.364746 -0.079549
C  -4.293447 0.920102 0.809946
C  -2.194074 2.681557 0.345488
C  -4.388484 2.246402 1.209855
C  -3.347664 3.126877 0.985415
C  0.039055 3.160337 -0.194071
C  0.887861 2.654588 0.779521
C  0.444574 3.250212 -1.515277
C  2.160094 2.237865 0.420804
C  1.720635 2.829376 -1.862801
C  2.579301 2.321308 -0.899578
H  0.707664 -1.507755 -0.600318
H  0.227792 -2.289854 2.363089
H  -0.798546 -4.832404 -0.258591
H  0.613139 -4.572846 -1.276881
H  -0.677275 -3.38438 -1.257554
H  0.923551 -5.17645 1.660488
H  1.985515 -3.855776 2.13094
H  2.288158 -4.730251 0.635953
H  2.49209 -1.388435 1.889623
H  -3.803088 -1.550008 0.179142
H  -1.207675 1.018689 -0.593412
H  -5.1018 0.22927 1.011049
H  -5.278451 2.59288 1.717584
H  -3.412999 4.15814 1.305988
H  0.554565 2.596207 1.807786
H  -0.233422 3.646212 -2.260034
H  2.829975 1.849172 1.17597
H  2.041639 2.89719 -2.893657
H  3.572377 1.992453 -1.173369
totalener: -2050.65791901 hartree
nucrepener: 2927.80140533 hartree
electener: -4978.45932433 hartree
oneelecener: -8630.72089912 hartree
twoeener: 3652.26157479 hartree
kineticenergy: 2044.54399835 hartree
xcener: -151.873934321919 hartree
chargesum: -0.0000000
charge: -0.036190 -0.045400 -0.280436 -0.333061 -0.297327 0.002066 0.115261 0.015178 -0.114025 -0.261486 -0.234785 -0.192339 0.324840 0.028275 0.272489 0.061340 -0.260447 -0.168922 -0.170682 0.224634 -0.078006 -0.202838 0.206308 -0.149715 -0.160127 -0.123118 -0.118208 -0.116434 0.098431 0.083053 0.095306 0.090452 0.097404 0.097628 0.073798 0.097253 0.110388 0.127463 0.124018 0.105739 0.126167 0.127599 0.128950 0.128399 0.124011 0.128865 0.128231
qa: -0.0362 -0.0454 -0.2804 -0.3331 -0.2973 0.0021 0.1153 0.0152 -0.1140 -0.2615 -0.2348 -0.1923 0.3248 0.0283 0.2725 0.0613 -0.2604 -0.1689 -0.1707 0.2246 -0.0780 -0.2028 0.2063 -0.1497 -0.1601 -0.1231 -0.1182 -0.1164 0.0984 0.0831 0.0953 0.0905 0.0974 0.0976 0.0738 0.0973 0.1104 0.1275 0.1240 0.1057 0.1262 0.1276 0.1290 0.1284 0.1240 0.1289 0.1282
va: 1.2893 1.2608 2.0919 2.1765 2.1195 3.1170 3.7357 3.7617 3.9155 3.9257 3.9138 3.8421 4.2687 4.2282 3.8790 3.6830 4.0079 3.9271 4.0471 3.8649 3.9552 4.0380 3.8444 4.0175 4.0109 3.8736 3.9870 3.8776 1.0287 1.0337 1.0010 1.0044 1.0124 1.0041 1.0079 1.0041 1.0187 1.0193 1.0251 1.0129 0.9995 1.0130 1.0070 1.0093 1.0093 1.0005 1.0162
dispcorr: -0.029114661 hartree
energy: -2050.687033665779
dipole: -13.86663 14.50880 0.64216 -8.63552 8.26059 -0.37493 6.72795 -5.76056 0.96739
magnitude: 1.22016 au
magnitude: 3.10140 debye
