program: Orca
programVersion: 5.0.2
elementType: Cl Cl O O O N C C C C C C C C C C C C C C C C C C C C C C H H H H H H H H H H H H H H H H H H H
charge: 0
multiplicity: 1
keywords: wb97x-d3
keywords: def2-TZVPP
keywords: def2/J RIJCOSX
keywords: DEFGRID2
keywords: scfconv7
keywords: smallprint printgap noloewdin
keywords: NOSOSCF
formula: C22H19Cl2NO3
InChI: InChI=1/C22H19Cl2NO3/c1-22(2)17(12-19(23)24)20(22)21(26)28-18(13-25)14-7-6-10-16(11-14)27-15-8-4-3-5-9-15/h3-12,17-18,20H,1-2H3
47 atoms
Cl 3.524563 -4.684354 1.101196
Cl 2.663324 -6.94485 -0.469194
O  -1.785084 -1.352382 -0.333756
O  0.071229 -0.888867 0.826924
O  -1.43119 4.162259 1.577797
N  -5.029838 -0.99821 0.176924
C  1.393272 -2.079088 -1.794508
C  1.488052 -3.048014 -0.651699
C  0.149594 -2.434807 -1.003086
C  2.048231 -0.729482 -1.6290
C  1.43556 -2.58602 -3.216426
C  1.68438 -4.489366 -0.855127
C  -0.472371 -1.481308 -0.062368
C  2.513099 -5.260424 -0.161587
C  -2.498542 -0.410505 0.453432
C  -2.238806 1.011659 0.016973
C  -3.913779 -0.751377 0.288004
C  -1.902802 1.961529 0.963818
C  -2.345207 1.36089 -1.324416
C  -1.694231 3.280884 0.57934
C  -2.116505 2.673251 -1.69828
C  -1.794851 3.641638 -0.757668
C  -0.748447 5.317647 1.310327
C  0.525076 5.287347 0.757381
C  -1.339822 6.520065 1.662762
C  1.20601 6.477716 0.559456
C  -0.644045 7.704107 1.46733
C  0.626591 7.688566 0.913042
H  1.943315 -2.640577 0.243834
H  -0.557833 -3.068528 -1.526263
H  3.076231 -0.777844 -1.991173
H  2.076269 -0.393037 -0.595689
H  1.525606 0.028706 -2.214978
H  2.466197 -2.750158 -3.534141
H  0.991643 -1.852319 -3.890671
H  0.894337 -3.520946 -3.355969
H  1.103737 -4.981527 -1.62562
H  -2.246557 -0.522826 1.513192
H  -1.797755 1.691804 2.007144
H  -2.612299 0.621368 -2.067952
H  -2.201906 2.9578 -2.738432
H  -1.634856 4.665371 -1.068967
H  0.982714 4.342164 0.494245
H  -2.332322 6.521794 2.093712
H  2.200926 6.456796 0.135018
H  -1.102918 8.6430 1.747276
H  1.165715 8.613822 0.762288
totalener: -2050.66101631 hartree
nucrepener: 2662.07884357 hartree
electener: -4712.73985988 hartree
oneelecener: -8099.32360916 hartree
twoeener: 3386.58374929 hartree
kineticenergy: 2044.53484037 hartree
xcener: -151.870162670055 hartree
chargesum: -0.0000000
charge: -0.038493 -0.043657 -0.264741 -0.362907 -0.294087 0.000051 0.063138 0.045089 -0.084658 -0.242626 -0.241850 -0.203600 0.326664 0.049962 0.307842 0.048158 -0.252251 -0.158194 -0.201274 0.202990 -0.115024 -0.143223 0.210902 -0.152854 -0.185022 -0.117821 -0.103564 -0.130667 0.086697 0.083233 0.091582 0.100397 0.087033 0.099810 0.093917 0.073381 0.098057 0.121384 0.108098 0.124923 0.129938 0.134094 0.136432 0.127875 0.128524 0.128272 0.128070
qa: -0.0385 -0.0437 -0.2647 -0.3629 -0.2941 0.0001 0.0631 0.0451 -0.0847 -0.2426 -0.2418 -0.2036 0.3267 0.0500 0.3078 0.0482 -0.2523 -0.1582 -0.2013 0.2030 -0.1150 -0.1432 0.2109 -0.1529 -0.1850 -0.1178 -0.1036 -0.1307 0.0867 0.0832 0.0916 0.1004 0.0870 0.0998 0.0939 0.0734 0.0981 0.1214 0.1081 0.1249 0.1299 0.1341 0.1364 0.1279 0.1285 0.1283 0.1281
va: 1.2887 1.2616 2.1264 2.1448 2.1093 3.1200 3.7708 3.8307 3.8535 3.9128 3.9075 3.9184 4.2724 4.2508 3.8444 3.6538 4.0193 4.0768 4.0182 3.9191 3.9629 3.9285 3.8300 3.9665 4.0325 3.9425 3.9367 3.9510 1.0502 1.0353 1.0017 1.0205 1.0029 1.0031 1.0042 1.0101 1.0299 1.0192 1.0272 1.0191 1.0005 1.0049 1.0022 1.0120 0.9997 0.9989 0.9998
dispcorr: -0.023084756 hartree
energy: -2050.684101062723
dipole: -4.63960 5.82144 1.18184 38.73259 -37.51221 1.22038 -15.17433 14.04979 -1.12454
magnitude: 2.03732 au
magnitude: 5.17845 debye
