program: Orca
programVersion: 5.0.2
elementType: Cl Cl O O O N C C C C C C C C C C C C C C C C C C C C C C H H H H H H H H H H H H H H H H H H H
charge: 0
multiplicity: 1
keywords: wb97x-d3
keywords: def2-TZVPP
keywords: def2/J RIJCOSX
keywords: DEFGRID2
keywords: scfconv7
keywords: smallprint printgap noloewdin
keywords: NOSOSCF
formula: C22H19Cl2NO3
InChI: InChI=1/C22H19Cl2NO3/c1-22(2)17(12-19(23)24)20(22)21(26)28-18(13-25)14-7-6-10-16(11-14)27-15-8-4-3-5-9-15/h3-12,17-18,20H,1-2H3
47 atoms
Cl 4.022862 -4.277572 0.390264
Cl 2.596033 -6.721416 -0.167895
O  -1.350486 -0.932692 0.24741
O  0.762345 -0.192742 0.223046
O  -1.338612 4.775246 -0.658441
N  -3.6122 -0.657364 2.652665
C  1.078468 -2.176146 -2.171955
C  1.537858 -2.859316 -0.918607
C  0.17346 -2.193741 -0.956279
C  1.796092 -0.91563 -2.589676
C  0.617696 -3.005887 -3.347537
C  1.608504 -4.321711 -0.80113
C  -0.057056 -0.999977 -0.118233
C  2.612115 -5.005323 -0.264285
C  -1.737312 0.184188 1.039214
C  -2.219944 1.322204 0.17498
C  -2.793722 -0.298983 1.930909
C  -1.535426 2.527283 0.192614
C  -3.326507 1.148672 -0.648004
C  -1.977221 3.577646 -0.605254
C  -3.743022 2.194616 -1.452864
C  -3.079572 3.411565 -1.430986
C  -0.731053 5.276655 0.459924
C  0.555246 5.774595 0.323714
C  -1.391563 5.343817 1.680285
C  1.182833 6.351341 1.417648
C  -0.748697 5.913819 2.767668
C  0.537724 6.419482 2.643019
H  2.28562 -2.310997 -0.356871
H  -0.682259 -2.855251 -1.029626
H  2.19377 -0.351706 -1.750233
H  1.128971 -0.258242 -3.150228
H  2.630256 -1.175878 -3.243553
H  1.474917 -3.378218 -3.910714
H  0.013689 -2.398215 -4.022649
H  0.013231 -3.86525 -3.059198
H  0.776834 -4.905078 -1.176555
H  -0.903387 0.51913 1.663305
H  -0.658418 2.643912 0.817258
H  -3.863439 0.208824 -0.656137
H  -4.604257 2.070102 -2.095257
H  -3.409405 4.23532 -2.050098
H  1.052597 5.714811 -0.635314
H  -2.399984 4.962506 1.780454
H  2.185387 6.743517 1.309613
H  -1.263047 5.967984 3.718017
H  1.031585 6.866015 3.49524
totalener: -2050.66154338 hartree
nucrepener: 2675.91810867 hartree
electener: -4726.57965206 hartree
oneelecener: -8127.06886251 hartree
twoeener: 3400.48921045 hartree
kineticenergy: 2044.52892778 hartree
xcener: -151.869290896031 hartree
chargesum: 0.0000000
charge: -0.038458 -0.043216 -0.265012 -0.380274 -0.297349 -0.001487 0.071797 0.039782 -0.104405 -0.247701 -0.240781 -0.199578 0.361500 0.048938 0.314988 0.006436 -0.254194 -0.109951 -0.189249 0.202936 -0.093933 -0.190433 0.223869 -0.197003 -0.156300 -0.094474 -0.115360 -0.138394 0.088470 0.081082 0.103233 0.088355 0.089640 0.100077 0.093788 0.072989 0.098398 0.117790 0.124989 0.122807 0.129826 0.130267 0.126225 0.135705 0.127020 0.129746 0.126902
qa: -0.0385 -0.0432 -0.2650 -0.3803 -0.2973 -0.0015 0.0718 0.0398 -0.1044 -0.2477 -0.2408 -0.1996 0.3615 0.0489 0.3150 0.0064 -0.2542 -0.1100 -0.1892 0.2029 -0.0939 -0.1904 0.2239 -0.1970 -0.1563 -0.0945 -0.1154 -0.1384 0.0885 0.0811 0.1032 0.0884 0.0896 0.1001 0.0938 0.0730 0.0984 0.1178 0.1250 0.1228 0.1298 0.1303 0.1262 0.1357 0.1270 0.1297 0.1269
va: 1.2889 1.2620 2.1345 2.1218 2.1109 3.1176 3.7446 3.8357 3.8862 3.9139 3.9104 3.9159 4.2265 4.2507 3.8370 3.6746 4.0257 3.8982 4.0409 3.8779 3.9465 4.0360 3.8201 4.0397 3.9512 3.9363 3.9493 3.9597 1.0479 1.0364 1.0217 1.0019 1.0010 1.0027 1.0045 1.0099 1.0297 1.0258 1.0187 1.0159 0.9993 1.0112 1.0131 1.0027 0.9989 0.9995 1.0001
dispcorr: -0.022736347 hartree
energy: -2050.684279732230
dipole: -12.12365 12.39261 0.26896 31.73645 -31.02975 0.70670 -13.58536 12.24658 -1.33878
magnitude: 1.53756 au
magnitude: 3.90817 debye
