program: Orca
programVersion: 5.0.2
elementType: Cl Cl O O O N C C C C C C C C C C C C C C C C C C C C C C H H H H H H H H H H H H H H H H H H H
charge: 0
multiplicity: 1
keywords: wb97x-d3
keywords: def2-TZVPP
keywords: def2/J RIJCOSX
keywords: DEFGRID2
keywords: scfconv7
keywords: smallprint printgap noloewdin
keywords: NOSOSCF
formula: C22H19Cl2NO3
InChI: InChI=1/C22H19Cl2NO3/c1-22(2)17(12-19(23)24)20(22)21(26)28-18(13-25)14-7-6-10-16(11-14)27-15-8-4-3-5-9-15/h3-12,17-18,20H,1-2H3
47 atoms
Cl 1.071909 -5.947636 -1.38253
Cl 3.790867 -5.3535 -2.135978
O  -0.571106 0.06929 -0.964361
O  -1.564971 -1.805288 -0.251555
O  -2.046276 4.339163 1.958212
N  -1.461785 2.256021 -3.278265
C  1.190075 -2.26891 1.165457
C  1.099605 -3.087524 -0.086646
C  0.815512 -1.59801 -0.141808
C  0.155133 -2.504656 2.238493
C  2.544896 -1.907911 1.727368
C  2.282005 -3.619625 -0.773794
C  -0.56571 -1.165314 -0.435654
C  2.360814 -4.813647 -1.349655
C  -1.848004 0.625423 -1.274285
C  -2.448194 1.314376 -0.074102
C  -1.617472 1.543446 -2.391174
C  -1.935463 2.534767 0.353027
C  -3.477868 0.698226 0.620237
C  -2.461836 3.136249 1.487118
C  -4.001814 1.31604 1.747155
C  -3.498066 2.525391 2.186809
C  -0.827927 4.838085 1.58264
C  0.345801 4.163309 1.890778
C  -0.793803 6.060907 0.933129
C  1.56225 4.72425 1.536168
C  0.430698 6.617255 0.592873
C  1.609996 5.950815 0.88778
H  0.211691 -3.705523 -0.152662
H  1.584466 -0.967871 -0.574303
H  -0.802146 -2.832122 1.842834
H  -0.013102 -1.596451 2.819701
H  0.513539 -3.2743 2.92391
H  2.459159 -1.049516 2.395152
H  3.27497 -1.648632 0.961423
H  2.951919 -2.739718 2.304287
H  3.167665 -2.999022 -0.830022
H  -2.527476 -0.156876 -1.6258
H  -1.143534 3.017167 -0.207125
H  -3.861567 -0.258357 0.293108
H  -4.807476 0.844521 2.293535
H  -3.902046 3.009614 3.066057
H  0.307935 3.211546 2.405497
H  -1.719892 6.570345 0.702176
H  2.478992 4.201572 1.774702
H  0.458909 7.57312 0.086985
H  2.562485 6.385073 0.616037
totalener: -2050.66180560 hartree
nucrepener: 2711.64792832 hartree
electener: -4762.30973392 hartree
oneelecener: -8198.52804597 hartree
twoeener: 3436.21831205 hartree
kineticenergy: 2044.53636519 hartree
xcener: -151.871503390329 hartree
chargesum: 0.0000000
charge: -0.038192 -0.043977 -0.259303 -0.386181 -0.294333 -0.001307 0.067068 0.038758 -0.094608 -0.246081 -0.247813 -0.204799 0.368225 0.055164 0.320420 -0.017616 -0.265304 -0.164130 -0.136652 0.221697 -0.090238 -0.201907 0.220020 -0.164464 -0.175953 -0.112372 -0.101172 -0.129459 0.087632 0.083503 0.102499 0.087421 0.090342 0.092662 0.074210 0.101008 0.097047 0.122565 0.131348 0.119767 0.128165 0.128590 0.128870 0.126881 0.126193 0.128010 0.127794
qa: -0.0382 -0.0440 -0.2593 -0.3862 -0.2943 -0.0013 0.0671 0.0388 -0.0946 -0.2461 -0.2478 -0.2048 0.3682 0.0552 0.3204 -0.0176 -0.2653 -0.1641 -0.1367 0.2217 -0.0902 -0.2019 0.2200 -0.1645 -0.1760 -0.1124 -0.1012 -0.1295 0.0876 0.0835 0.1025 0.0874 0.0903 0.0927 0.0742 0.1010 0.0970 0.1226 0.1313 0.1198 0.1282 0.1286 0.1289 0.1269 0.1262 0.1280 0.1278
va: 1.2893 1.2613 2.1397 2.1163 2.1154 3.1172 3.7568 3.8282 3.8736 3.9139 3.9108 3.9279 4.2241 4.2528 3.8301 3.7104 4.0325 3.9714 3.9826 3.8724 3.9568 4.0303 3.8316 3.9781 4.0422 3.9428 3.9412 3.9576 1.0511 1.0345 1.0212 1.0021 1.0013 1.0045 1.0100 1.0024 1.0311 1.0179 1.0157 1.0215 0.9995 1.0123 1.0047 1.0119 1.0000 0.9992 0.9999
dispcorr: -0.023266442 hartree
energy: -2050.685072045400
dipole: -4.64280 5.13983 0.49703 28.41829 -28.27239 0.14589 24.08061 -22.49027 1.59033
magnitude: 1.67257 au
magnitude: 4.25133 debye
