program: Orca
programVersion: 5.0.2
elementType: Cl Cl O O O N C C C C C C C C C C C C C C C C C C C C C C H H H H H H H H H H H H H H H H H H H
charge: 0
multiplicity: 1
keywords: wb97x-d3
keywords: def2-TZVPP
keywords: def2/J RIJCOSX
keywords: DEFGRID2
keywords: scfconv7
keywords: smallprint printgap noloewdin
keywords: NOSOSCF
formula: C22H19Cl2NO3
InChI: InChI=1/C22H19Cl2NO3/c1-22(2)17(12-19(23)24)20(22)21(26)28-18(13-25)14-7-6-10-16(11-14)27-15-8-4-3-5-9-15/h3-12,17-18,20H,1-2H3
47 atoms
Cl 1.144701 -3.615039 -2.370612
Cl 3.878774 -4.494397 -2.093873
O  -1.039916 -0.388722 -1.014178
O  -1.45294 -1.807087 0.667512
O  -1.501545 4.14109 1.241031
N  -2.89406 0.659501 -3.554479
C  1.589732 -1.3181 1.275471
C  1.419457 -2.621661 0.568616
C  0.801902 -1.380336 -0.02382
C  0.88951 -1.106476 2.594489
C  2.916989 -0.604644 1.176783
C  2.554735 -3.279657 -0.114638
C  -0.666663 -1.250832 -0.047101
C  2.525854 -3.732639 -1.360657
C  -2.418967 -0.082525 -1.094171
C  -2.815451 1.023012 -0.140972
C  -2.663024 0.331059 -2.478523
C  -1.926171 2.052841 0.130116
C  -4.087263 1.027224 0.411165
C  -2.319509 3.087849 0.967347
C  -4.474043 2.077662 1.228954
C  -3.594928 3.108234 1.515255
C  -0.168575 3.912393 1.440804
C  0.270109 2.968232 2.361006
C  0.739562 4.688582 0.737869
C  1.630026 2.811606 2.576398
C  2.098237 4.522099 0.963683
C  2.549298 3.583059 1.878789
H  0.704731 -3.303496 1.023658
H  1.302441 -0.947682 -0.881981
H  0.653412 -0.051003 2.739031
H  1.547056 -1.413947 3.409659
H  -0.034706 -1.671482 2.682122
H  3.594464 -0.940725 1.964501
H  2.778903 0.471402 1.291523
H  3.412788 -0.771668 0.220072
H  3.471651 -3.423832 0.445111
H  -3.027343 -0.971211 -0.895357
H  -0.937794 2.058125 -0.312112
H  -4.774557 0.216762 0.204872
H  -5.465442 2.086847 1.661173
H  -3.8869 3.92705 2.159201
H  -0.44535 2.371053 2.912536
H  0.379749 5.419554 0.025898
H  1.9723 2.085921 3.3029
H  2.806427 5.129119 0.415502
H  3.609217 3.457494 2.054078
totalener: -2050.65844576 hartree
nucrepener: 2843.46854498 hartree
electener: -4894.12699074 hartree
oneelecener: -8462.01185293 hartree
twoeener: 3567.88486219 hartree
kineticenergy: 2044.54809443 hartree
xcener: -151.874343273520 hartree
chargesum: -0.0000000
charge: -0.027211 -0.039160 -0.273600 -0.369383 -0.299811 0.001483 0.141923 -0.012282 -0.161293 -0.249876 -0.273370 -0.253623 0.351950 0.093745 0.305948 0.069951 -0.253734 -0.130202 -0.171861 0.162986 -0.089268 -0.189083 0.200645 -0.114556 -0.185820 -0.186472 -0.096804 -0.125755 0.106985 0.108749 0.061899 0.091870 0.108778 0.093810 0.091025 0.090820 0.118473 0.127644 0.132137 0.108852 0.128008 0.131341 0.138095 0.130603 0.145092 0.128683 0.131674
qa: -0.0272 -0.0392 -0.2736 -0.3694 -0.2998 0.0015 0.1419 -0.0123 -0.1613 -0.2499 -0.2734 -0.2536 0.3520 0.0937 0.3059 0.0700 -0.2537 -0.1302 -0.1719 0.1630 -0.0893 -0.1891 0.2006 -0.1146 -0.1858 -0.1865 -0.0968 -0.1258 0.1070 0.1087 0.0619 0.0919 0.1088 0.0938 0.0910 0.0908 0.1185 0.1276 0.1321 0.1089 0.1280 0.1313 0.1381 0.1306 0.1451 0.1287 0.1317
va: 1.3049 1.2662 2.1028 2.1345 2.1057 3.1222 3.6757 3.8597 3.8858 3.8962 3.9169 3.9109 4.1871 4.2059 3.8266 3.6852 4.0171 3.9071 4.0475 3.8819 3.9528 4.0370 3.8637 3.8948 4.0289 3.9183 3.9478 3.9240 1.0266 1.0248 1.0177 1.0028 1.0244 1.0008 1.0183 1.0037 1.0180 1.0243 1.0238 1.0119 0.9996 1.0103 1.0011 1.0116 0.9888 0.9981 0.9990
dispcorr: -0.027225009 hartree
energy: -2050.685670766294
dipole: -0.34276 1.26759 0.92483 23.62440 -23.43669 0.18771 28.68597 -26.84421 1.84176
magnitude: 2.06945 au
magnitude: 5.26013 debye
