program: Orca
programVersion: 5.0.2
elementType: Cl Cl O O O N C C C C C C C C C C C C C C C C C C C C C C H H H H H H H H H H H H H H H H H H H
charge: 0
multiplicity: 1
keywords: wb97x-d3
keywords: def2-TZVPP
keywords: def2/J RIJCOSX
keywords: DEFGRID2
keywords: scfconv7
keywords: smallprint printgap noloewdin
keywords: NOSOSCF
formula: C22H19Cl2NO3
InChI: InChI=1/C22H19Cl2NO3/c1-22(2)17(12-19(23)24)20(22)21(26)28-18(13-25)14-7-6-10-16(11-14)27-15-8-4-3-5-9-15/h3-12,17-18,20H,1-2H3
47 atoms
Cl 0.727477 -3.874287 -2.162023
Cl 3.46958 -4.539885 -2.770886
O  -1.131774 -0.376629 -0.557544
O  -0.907182 -1.797749 1.166916
O  -1.291977 4.378963 1.07277
N  -3.840922 -1.354259 -2.21421
C  2.120632 -0.973791 0.760816
C  1.868583 -2.364705 0.283327
C  0.977237 -1.25233 -0.204421
C  1.840242 -0.639491 2.204812
C  3.270456 -0.190525 0.174378
C  2.782846 -3.046873 -0.658828
C  -0.42828 -1.211488 0.237296
C  2.378297 -3.727654 -1.723059
C  -2.508211 -0.193721 -0.287015
C  -2.827003 1.281907 -0.154397
C  -3.257451 -0.833605 -1.373081
C  -1.868102 2.133315 0.384432
C  -4.081277 1.764213 -0.493557
C  -2.175105 3.473082 0.577364
C  -4.372541 3.1066 -0.29362
C  -3.430991 3.965323 0.23858
C  -0.105026 3.953461 1.605925
C  -0.069184 3.413909 2.884195
C  1.058847 4.118326 0.872205
C  1.149963 3.046594 3.432334
C  2.274426 3.74987 1.43199
C  2.323725 3.212879 2.709647
H  1.398116 -3.022288 1.01061
H  1.138538 -0.90139 -1.216971
H  2.741923 -0.80082 2.798385
H  1.049455 -1.248719 2.635894
H  1.560369 0.409748 2.313027
H  3.449206 -0.430493 -0.874062
H  4.192756 -0.389166 0.723887
H  3.069633 0.87992 0.241781
H  3.846763 -3.023467 -0.453758
H  -2.777987 -0.706097 0.643332
H  -0.88478 1.761906 0.638429
H  -4.830704 1.11086 -0.920659
H  -5.348807 3.486882 -0.56233
H  -3.653318 5.013153 0.390016
H  -0.986811 3.296025 3.446151
H  1.011056 4.542902 -0.121907
H  1.182104 2.63316 4.431591
H  3.186174 3.888501 0.865901
H  3.272968 2.930299 3.144458
totalener: -2050.65884587 hartree
nucrepener: 2829.76278569 hartree
electener: -4880.42163156 hartree
oneelecener: -8434.63181315 hartree
twoeener: 3554.21018159 hartree
kineticenergy: 2044.53126308 hartree
xcener: -151.872997237737 hartree
chargesum: 0.0000000
charge: -0.023199 -0.040044 -0.270945 -0.365801 -0.292450 -0.003204 0.141655 -0.016843 -0.172001 -0.228173 -0.275625 -0.254522 0.365866 0.094034 0.337536 -0.010999 -0.257992 -0.162891 -0.197701 0.266065 -0.071653 -0.214816 0.201109 -0.142533 -0.145375 -0.113854 -0.134431 -0.147253 0.110357 0.107319 0.089397 0.106722 0.053529 0.090924 0.092990 0.090195 0.118420 0.129654 0.106390 0.123748 0.128054 0.126071 0.132113 0.129192 0.133796 0.135145 0.132026
qa: -0.0232 -0.0400 -0.2709 -0.3658 -0.2924 -0.0032 0.1417 -0.0168 -0.1720 -0.2282 -0.2756 -0.2545 0.3659 0.0940 0.3375 -0.0110 -0.2580 -0.1629 -0.1977 0.2661 -0.0717 -0.2148 0.2011 -0.1425 -0.1454 -0.1139 -0.1344 -0.1473 0.1104 0.1073 0.0894 0.1067 0.0535 0.0909 0.0930 0.0902 0.1184 0.1297 0.1064 0.1237 0.1281 0.1261 0.1321 0.1292 0.1338 0.1351 0.1320
va: 1.3096 1.2657 2.1101 2.1414 2.1182 3.1125 3.6838 3.8577 3.8860 3.8874 3.9176 3.9149 4.1728 4.2070 3.7957 3.8532 4.0220 3.9259 4.0368 3.8208 3.9641 4.0460 3.8543 3.9835 4.0003 3.8635 3.8739 3.8633 1.0261 1.0262 1.0049 1.0243 1.0162 1.0032 1.0009 1.0129 1.0174 1.0258 1.0307 1.0210 0.9995 1.0146 1.0048 1.0092 0.9987 0.9967 1.0002
dispcorr: -0.027022682 hartree
energy: -2050.685868548826
dipole: 5.49596 -4.00004 1.49592 29.13765 -27.81952 1.31813 24.88560 -23.56072 1.32488
magnitude: 2.39386 au
magnitude: 6.08470 debye
