program: Orca
programVersion: 5.0.2
elementType: Cl Cl O O O N C C C C C C C C C C C C C C C C C C C C C C H H H H H H H H H H H H H H H H H H H
charge: 0
multiplicity: 1
keywords: wb97x-d3
keywords: def2-TZVPP
keywords: def2/J RIJCOSX
keywords: DEFGRID2
keywords: scfconv7
keywords: smallprint printgap noloewdin
keywords: NOSOSCF
formula: C22H19Cl2NO3
InChI: InChI=1/C22H19Cl2NO3/c1-22(2)17(12-19(23)24)20(22)21(26)28-18(13-25)14-7-6-10-16(11-14)27-15-8-4-3-5-9-15/h3-12,17-18,20H,1-2H3
47 atoms
Cl 0.830338 -4.013389 -2.103447
Cl 3.615219 -4.616296 -2.569732
O  -1.167839 -0.461517 -0.6927
O  -0.998213 -1.82308 1.084961
O  -1.079888 4.328816 0.661913
N  -3.869891 -1.026134 -2.562762
C  2.033476 -0.978046 0.778704
C  1.820855 -2.386582 0.335999
C  0.935874 -1.303937 -0.226675
C  1.69006 -0.60198 2.19835
C  3.201664 -0.201204 0.219578
C  2.791805 -3.07885 -0.540155
C  -0.486877 -1.26315 0.156984
C  2.454934 -3.806085 -1.596958
C  -2.540799 -0.241751 -0.451853
C  -2.818879 1.218222 -0.145549
C  -3.272991 -0.680151 -1.64473
C  -1.780358 2.094513 0.122732
C  -4.136112 1.660322 -0.100484
C  -2.067728 3.417398 0.441477
C  -4.40568 2.981998 0.210123
C  -3.376867 3.867888 0.488763
C  0.030424 3.954089 1.364222
C  -0.071802 3.319245 2.596282
C  1.271831 4.275041 0.836901
C  1.081778 3.012205 3.299944
C  2.418874 3.965296 1.553665
C  2.330451 3.33084 2.783551
H  1.328254 -3.028897 1.062289
H  1.136087 -0.983786 -1.242531
H  2.565016 -0.748901 2.834363
H  0.879139 -1.196589 2.612076
H  1.410757 0.450667 2.264281
H  2.99965 0.8702 0.264155
H  3.418282 -0.457261 -0.817856
H  4.104104 -0.390022 0.804578
H  3.844479 -3.019162 -0.289335
H  -2.878865 -0.856153 0.390381
H  -0.7504 1.769165 0.070097
H  -4.951567 0.982173 -0.319021
H  -5.430305 3.32695 0.240517
H  -3.580581 4.901769 0.733225
H  -1.043625 3.076459 3.007009
H  1.33211 4.77267 -0.122028
H  1.001461 2.523792 4.262221
H  3.386827 4.222097 1.143926
H  3.226558 3.09074 3.339396
totalener: -2050.65855907 hartree
nucrepener: 2827.01850939 hartree
electener: -4877.67706847 hartree
oneelecener: -8429.07577161 hartree
twoeener: 3551.39870314 hartree
kineticenergy: 2044.52938817 hartree
xcener: -151.872746941112 hartree
chargesum: 0.0000000
charge: -0.025019 -0.039486 -0.279571 -0.365235 -0.298468 -0.002082 0.150930 -0.016179 -0.190229 -0.230468 -0.275363 -0.250127 0.365930 0.091200 0.333103 0.041219 -0.254332 -0.136865 -0.205250 0.192645 -0.086524 -0.193905 0.196541 -0.114504 -0.179840 -0.142346 -0.119969 -0.137496 0.110135 0.108673 0.089163 0.105501 0.057893 0.092800 0.091040 0.092868 0.118090 0.134416 0.129228 0.121579 0.129293 0.129676 0.133913 0.130874 0.136960 0.130088 0.129500
qa: -0.0250 -0.0395 -0.2796 -0.3652 -0.2985 -0.0021 0.1509 -0.0162 -0.1902 -0.2305 -0.2754 -0.2501 0.3659 0.0912 0.3331 0.0412 -0.2543 -0.1369 -0.2052 0.1926 -0.0865 -0.1939 0.1965 -0.1145 -0.1798 -0.1423 -0.1200 -0.1375 0.1101 0.1087 0.0892 0.1055 0.0579 0.0928 0.0910 0.0929 0.1181 0.1344 0.1292 0.1216 0.1293 0.1297 0.1339 0.1309 0.1370 0.1301 0.1295
va: 1.3073 1.2662 2.1005 2.1430 2.1058 3.1133 3.6843 3.8681 3.8935 3.8804 3.9221 3.9121 4.1640 4.2099 3.7570 3.7346 3.9987 3.9196 4.0507 3.8631 3.9565 4.0374 3.8476 3.8941 4.0063 3.8935 3.8983 3.8814 1.0255 1.0260 1.0049 1.0238 1.0205 1.0090 1.0024 1.0010 1.0172 1.0293 1.0176 1.0149 0.9993 1.0113 1.0038 1.0112 0.9982 0.9981 1.0000
dispcorr: -0.026976331 hartree
energy: -2050.685535405912
dipole: 4.16932 -2.84102 1.32830 29.61918 -28.51969 1.09949 25.69829 -24.19139 1.50689
magnitude: 2.28997 au
magnitude: 5.82065 debye
