program: Orca
programVersion: 5.0.2
elementType: Cl Cl O O O N C C C C C C C C C C C C C C C C C C C C C C H H H H H H H H H H H H H H H H H H H
charge: 0
multiplicity: 1
keywords: wb97x-d3
keywords: def2-TZVPP
keywords: def2/J RIJCOSX
keywords: DEFGRID2
keywords: scfconv7
keywords: smallprint printgap noloewdin
keywords: NOSOSCF
formula: C22H19Cl2NO3
InChI: InChI=1/C22H19Cl2NO3/c1-22(2)17(12-19(23)24)20(22)21(26)28-18(13-25)14-7-6-10-16(11-14)27-15-8-4-3-5-9-15/h3-12,17-18,20H,1-2H3
47 atoms
Cl 2.655605 0.281936 0.368568
Cl 4.271628 -0.959883 2.412417
O  -1.57037 -1.596634 -0.457356
O  -2.526702 -2.435792 1.380712
O  -0.80027 3.502596 0.289651
N  -2.786228 -0.556699 -3.348044
C  0.566936 -3.76153 -0.02817
C  1.046797 -2.405508 0.390229
C  -0.255274 -2.952189 0.954758
C  0.125856 -3.948689 -1.460737
C  1.221001 -4.999169 0.541382
C  2.193922 -2.206781 1.284341
C  -1.564187 -2.323836 0.675764
C  2.937395 -1.108014 1.337801
C  -2.762398 -0.884723 -0.754706
C  -2.805539 0.453236 -0.057389
C  -2.763883 -0.709937 -2.209809
C  -1.740256 1.332696 -0.220175
C  -3.897389 0.796033 0.720353
C  -1.791355 2.580954 0.381556
C  -3.931691 2.045221 1.326606
C  -2.892179 2.938718 1.156524
C  0.156493 3.397542 -0.684339
C  1.483247 3.360072 -0.28766
C  -0.183147 3.383137 -2.030779
C  2.48105 3.307945 -1.250737
C  0.822005 3.317477 -2.982239
C  2.154977 3.279124 -2.597817
H  0.921295 -1.634418 -0.359881
H  -0.218731 -3.316767 1.974961
H  -0.669882 -4.692578 -1.527804
H  0.966161 -4.313236 -2.053319
H  -0.227621 -3.034326 -1.92918
H  0.561188 -5.859778 0.425581
H  1.450931 -4.915982 1.602986
H  2.150677 -5.219484 0.014363
H  2.466044 -3.006213 1.961927
H  -3.643701 -1.473641 -0.482283
H  -0.884186 1.043133 -0.816792
H  -4.711577 0.097368 0.860165
H  -4.779145 2.324848 1.937691
H  -2.917329 3.915225 1.621795
H  1.728108 3.377162 0.765995
H  -1.221764 3.420009 -2.33408
H  3.517571 3.282498 -0.941627
H  0.55841 3.29994 -4.031153
H  2.934878 3.230412 -3.345446
totalener: -2050.65886338 hartree
nucrepener: 2892.54574934 hartree
electener: -4943.20461271 hartree
oneelecener: -8560.45470330 hartree
twoeener: 3617.25009058 hartree
kineticenergy: 2044.53949310 hartree
xcener: -151.873859523774 hartree
chargesum: -0.0000000
charge: -0.040131 -0.046858 -0.281764 -0.342603 -0.294636 -0.001316 0.078249 0.047047 -0.072613 -0.245577 -0.268505 -0.215741 0.336389 0.061231 0.299505 0.035345 -0.267470 -0.204910 -0.154092 0.262939 -0.079300 -0.211861 0.308061 -0.284034 -0.192100 -0.107857 -0.101497 -0.125286 0.083597 0.085823 0.093215 0.089104 0.096214 0.096750 0.076184 0.102216 0.098471 0.122997 0.120519 0.110945 0.127428 0.128162 0.138744 0.137372 0.140998 0.132162 0.128485
qa: -0.0401 -0.0469 -0.2818 -0.3426 -0.2946 -0.0013 0.0782 0.0470 -0.0726 -0.2456 -0.2685 -0.2157 0.3364 0.0612 0.2995 0.0353 -0.2675 -0.2049 -0.1541 0.2629 -0.0793 -0.2119 0.3081 -0.2840 -0.1921 -0.1079 -0.1015 -0.1253 0.0836 0.0858 0.0932 0.0891 0.0962 0.0968 0.0762 0.1022 0.0985 0.1230 0.1205 0.1109 0.1274 0.1282 0.1387 0.1374 0.1410 0.1322 0.1285
va: 1.3009 1.2601 2.1009 2.1679 2.1256 3.1145 3.7560 3.7991 3.8222 3.9185 3.9249 3.9371 4.2811 4.2545 3.8674 3.6775 4.0145 3.9595 4.0187 3.8361 3.9498 4.0344 3.6920 3.9925 3.9884 3.8483 3.9382 3.9527 1.0359 1.0295 1.0017 1.0025 1.0124 1.0035 1.0095 1.0006 1.0328 1.0224 1.0256 1.0143 0.9997 1.0127 1.0158 1.0026 0.9979 0.9986 0.9991
dispcorr: -0.026655978 hartree
energy: -2050.685519353040
dipole: -11.76482 12.21290 0.44807 -11.92107 11.35236 -0.56871 -9.78761 10.25811 0.47050
magnitude: 0.86346 au
magnitude: 2.19475 debye
