program: Orca
programVersion: 5.0.2
elementType: Cl Cl O O O N C C C C C C C C C C C C C C C C C C C C C C H H H H H H H H H H H H H H H H H H H
charge: 0
multiplicity: 1
keywords: wb97x-d3
keywords: def2-TZVPP
keywords: def2/J RIJCOSX
keywords: DEFGRID2
keywords: scfconv7
keywords: smallprint printgap noloewdin
keywords: NOSOSCF
formula: C22H19Cl2NO3
InChI: InChI=1/C22H19Cl2NO3/c1-22(2)17(12-19(23)24)20(22)21(26)28-18(13-25)14-7-6-10-16(11-14)27-15-8-4-3-5-9-15/h3-12,17-18,20H,1-2H3
47 atoms
Cl 0.373554 -6.590993 -0.482464
Cl 2.594542 -6.542312 -2.321099
O  -0.606044 -0.394462 -1.119072
O  -1.424721 -1.863704 0.36153
O  -0.775419 4.83957 0.078772
N  -2.139049 1.10758 -3.628607
C  1.607125 -2.506756 0.822956
C  0.999446 -3.532669 -0.086609
C  0.835706 -2.057146 -0.401556
C  1.022177 -2.352121 2.20621
C  3.097175 -2.262375 0.787513
C  1.801615 -4.365233 -0.991689
C  -0.514396 -1.465231 -0.313135
C  1.608082 -5.657521 -1.226798
C  -1.86007 0.285109 -1.164622
C  -1.900102 1.418072 -0.169068
C  -2.006732 0.749129 -2.545826
C  -1.307834 2.636161 -0.467155
C  -2.492557 1.212806 1.071307
C  -1.319961 3.659443 0.470806
C  -2.492235 2.239238 2.001571
C  -1.913048 3.464864 1.713028
C  -0.310823 5.726177 1.011157
C  -0.817558 7.015515 0.993548
C  0.683341 5.366069 1.911549
C  -0.317336 7.956421 1.881853
C  1.168187 6.312699 2.799857
C  0.671587 7.608714 2.789165
H  0.104492 -4.003483 0.303819
H  1.442275 -1.661837 -1.208492
H  1.557392 -3.001983 2.89999
H  -0.032182 -2.609726 2.256383
H  1.135424 -1.326002 2.560214
H  3.327587 -1.283427 1.209844
H  3.515256 -2.285127 -0.218154
H  3.620792 -3.013431 1.380855
H  2.616726 -3.897708 -1.530093
H  -2.676889 -0.412883 -0.958701
H  -0.850099 2.815455 -1.432581
H  -2.943788 0.25934 1.309442
H  -2.958359 2.089783 2.966137
H  -1.935983 4.261026 2.445393
H  -1.589252 7.276748 0.28159
H  1.080355 4.358855 1.911166
H  -0.708895 8.964824 1.864858
H  1.946525 6.036523 3.498778
H  1.058448 8.344587 3.480949
totalener: -2050.66183041 hartree
nucrepener: 2642.75809133 hartree
electener: -4693.41992174 hartree
oneelecener: -8060.70919269 hartree
twoeener: 3367.28927095 hartree
kineticenergy: 2044.52950117 hartree
xcener: -151.869776845248 hartree
chargesum: -0.0000000
charge: -0.038868 -0.043184 -0.257610 -0.388238 -0.290926 -0.002159 0.066332 0.040739 -0.097691 -0.248255 -0.241808 -0.202321 0.369792 0.051840 0.321564 -0.007735 -0.259714 -0.184464 -0.135383 0.194607 -0.125393 -0.144366 0.211644 -0.183082 -0.152472 -0.104166 -0.117937 -0.129946 0.087295 0.082951 0.090312 0.101954 0.088324 0.093937 0.073509 0.099588 0.097332 0.123683 0.122071 0.128022 0.130881 0.134170 0.128765 0.132355 0.128237 0.127810 0.128004
qa: -0.0389 -0.0432 -0.2576 -0.3882 -0.2909 -0.0022 0.0663 0.0407 -0.0977 -0.2483 -0.2418 -0.2023 0.3698 0.0518 0.3216 -0.0077 -0.2597 -0.1845 -0.1354 0.1946 -0.1254 -0.1444 0.2116 -0.1831 -0.1525 -0.1042 -0.1179 -0.1299 0.0873 0.0830 0.0903 0.1020 0.0883 0.0939 0.0735 0.0996 0.0973 0.1237 0.1221 0.1280 0.1309 0.1342 0.1288 0.1324 0.1282 0.1278 0.1280
va: 1.2884 1.2620 2.1319 2.1130 2.1122 3.1144 3.7564 3.8303 3.8771 3.9144 3.9106 3.9218 4.2195 4.2519 3.8117 3.7398 4.0281 4.0972 3.9641 3.9176 3.9806 3.9289 3.8264 4.0323 3.9658 3.9382 3.9432 3.9498 1.0494 1.0356 1.0015 1.0210 1.0017 1.0040 1.0104 1.0025 1.0305 1.0191 1.0303 1.0209 1.0011 1.0050 1.0119 1.0032 0.9989 0.9998 0.9998
dispcorr: -0.022579903 hartree
energy: -2050.684410313294
dipole: 3.45146 -2.58543 0.86603 37.65405 -36.86407 0.78997 24.62324 -22.62188 2.00136
magnitude: 2.31938 au
magnitude: 5.89539 debye
