program: Orca
programVersion: 5.0.2
elementType: Cl Cl O O O N C C C C C C C C C C C C C C C C C C C C C C H H H H H H H H H H H H H H H H H H H
charge: 0
multiplicity: 1
keywords: wb97x-d3
keywords: def2-TZVPP
keywords: def2/J RIJCOSX
keywords: DEFGRID2
keywords: scfconv7
keywords: smallprint printgap noloewdin
keywords: NOSOSCF
formula: C22H19Cl2NO3
InChI: InChI=1/C22H19Cl2NO3/c1-22(2)17(12-19(23)24)20(22)21(26)28-18(13-25)14-7-6-10-16(11-14)27-15-8-4-3-5-9-15/h3-12,17-18,20H,1-2H3
47 atoms
Cl 2.691941 0.517006 0.893777
Cl 4.521451 -1.184287 2.341674
O  -1.64417 -1.419329 0.27818
O  -2.301354 -3.308536 1.27642
O  -0.786228 3.451032 0.055657
N  -4.202783 -2.111648 -1.78042
C  0.728348 -3.257376 -0.594339
C  1.11738 -2.133577 0.322126
C  -0.011618 -3.064495 0.714957
C  0.073135 -2.898524 -1.906939
C  1.59467 -4.490338 -0.691298
C  2.354707 -2.145492 1.112225
C  -1.426408 -2.645747 0.799189
C  3.082015 -1.074647 1.407259
C  -2.977351 -0.964351 0.228904
C  -2.99457 0.541814 0.067048
C  -3.664984 -1.614671 -0.895768
C  -1.828448 1.287902 0.115185
C  -4.223668 1.173004 -0.091985
C  -1.899373 2.671156 -0.018893
C  -4.279305 2.550311 -0.205756
C  -3.118344 3.307945 -0.178658
C  0.335879 3.128324 -0.650981
C  1.548374 3.545339 -0.117332
C  0.295146 2.468839 -1.873334
C  2.721623 3.304159 -0.813944
C  1.480108 2.222793 -2.55124
C  2.695895 2.636343 -2.029839
H  0.813799 -1.153537 -0.023649
H  0.215523 -3.809262 1.469482
H  0.833995 -2.818201 -2.684709
H  -0.459528 -1.951211 -1.877475
H  -0.633415 -3.671413 -2.213559
H  2.43944 -4.312125 -1.358557
H  1.019831 -5.324123 -1.096174
H  1.993524 -4.811915 0.269979
H  2.70897 -3.092892 1.499174
H  -3.509847 -1.240653 1.145591
H  -0.866293 0.816327 0.260741
H  -5.136906 0.592116 -0.13413
H  -5.235256 3.040617 -0.329568
H  -3.151893 4.384622 -0.27715
H  1.562983 4.06091 0.833829
H  -0.647401 2.156227 -2.303454
H  3.663685 3.631786 -0.394654
H  1.444919 1.709597 -3.503101
H  3.614899 2.44003 -2.56451
totalener: -2050.65759594 hartree
nucrepener: 2901.74633422 hartree
electener: -4952.40393016 hartree
oneelecener: -8578.49668566 hartree
twoeener: 3626.09275550 hartree
kineticenergy: 2044.53659319 hartree
xcener: -151.876738126780 hartree
chargesum: 0.0000000
charge: -0.038499 -0.048412 -0.277970 -0.330169 -0.295027 0.000241 0.069540 0.097086 -0.078019 -0.242452 -0.256859 -0.227206 0.328771 0.066281 0.279325 0.072790 -0.251665 -0.189690 -0.199001 0.234783 -0.092977 -0.193675 0.279937 -0.228942 -0.169897 -0.144465 -0.123701 -0.109778 0.051054 0.082556 0.090164 0.080199 0.105814 0.099106 0.098967 0.074131 0.095522 0.134979 0.128387 0.123120 0.130429 0.129709 0.126370 0.133228 0.131470 0.128291 0.126157
qa: -0.0385 -0.0484 -0.2780 -0.3302 -0.2950 0.0002 0.0695 0.0971 -0.0780 -0.2425 -0.2569 -0.2272 0.3288 0.0663 0.2793 0.0728 -0.2517 -0.1897 -0.1990 0.2348 -0.0930 -0.1937 0.2799 -0.2289 -0.1699 -0.1445 -0.1237 -0.1098 0.0511 0.0826 0.0902 0.0802 0.1058 0.0991 0.0990 0.0741 0.0955 0.1350 0.1284 0.1231 0.1304 0.1297 0.1264 0.1332 0.1315 0.1283 0.1262
va: 1.3114 1.2583 2.0928 2.1713 2.1167 3.1076 3.7676 3.7859 3.8359 3.9097 3.9175 3.9374 4.2839 4.2444 3.8178 3.6940 3.9388 3.9797 4.0373 3.8525 3.9523 4.0435 3.7418 3.9430 3.9158 3.9016 3.9536 3.9114 1.0292 1.0312 1.0033 1.0188 1.0025 1.0011 1.0033 1.0102 1.0315 1.0149 1.0144 1.0129 0.9995 1.0112 1.0163 1.0048 1.0005 0.9998 0.9990
dispcorr: -0.027459238 hartree
energy: -2050.685055175059
dipole: -9.91127 10.77859 0.86732 -6.87137 7.30876 0.43738 -17.07457 17.06318 -0.01139
magnitude: 0.97143 au
magnitude: 2.46918 debye
