program: Orca
programVersion: 5.0.2
elementType: Cl Cl O O O N C C C C C C C C C C C C C C C C C C C C C C H H H H H H H H H H H H H H H H H H H
charge: 0
multiplicity: 1
keywords: wb97x-d3
keywords: def2-TZVPP
keywords: def2/J RIJCOSX
keywords: DEFGRID2
keywords: scfconv7
keywords: smallprint printgap noloewdin
keywords: NOSOSCF
formula: C22H19Cl2NO3
InChI: InChI=1/C22H19Cl2NO3/c1-22(2)17(12-19(23)24)20(22)21(26)28-18(13-25)14-7-6-10-16(11-14)27-15-8-4-3-5-9-15/h3-12,17-18,20H,1-2H3
47 atoms
Cl 1.468909 -0.276231 2.295315
Cl 4.313908 -0.382344 1.817949
O  -1.611812 -1.295189 -0.397942
O  -1.928056 -2.64087 1.367132
O  -0.941402 3.671347 -0.445531
N  -4.023703 -1.490237 -2.662784
C  0.837868 -3.109092 -0.910826
C  1.197714 -1.73969 -0.432868
C  0.217097 -2.561967 0.365429
C  0.028734 -3.258441 -2.176294
C  1.828928 -4.229881 -0.702238
C  2.533122 -1.426233 0.119044
C  -1.20691 -2.198198 0.520682
C  2.737407 -0.789157 1.262864
C  -2.947024 -0.839718 -0.368522
C  -3.007538 0.660401 -0.167213
C  -3.549751 -1.207302 -1.655278
C  -1.885585 1.447655 -0.384171
C  -4.21497 1.233466 0.200976
C  -1.982973 2.825844 -0.237942
C  -4.298246 2.610908 0.339339
C  -3.191916 3.411271 0.121934
C  0.318193 3.151728 -0.609341
C  1.113808 2.940636 0.505333
C  0.789644 2.875272 -1.883945
C  2.402203 2.456441 0.339239
C  2.078163 2.382484 -2.03802
C  2.884801 2.169272 -0.92924
H  0.769871 -0.921492 -1.006738
H  0.596401 -3.018424 1.272294
H  0.700739 -3.373122 -3.028224
H  -0.613237 -2.406283 -2.383432
H  -0.599602 -4.149358 -2.133451
H  2.401461 -4.114677 0.218378
H  2.53751 -4.274954 -1.531522
H  1.31529 -5.190823 -0.654505
H  3.404878 -1.688109 -0.469572
H  -3.506697 -1.343113 0.426909
H  -0.945764 0.994471 -0.664795
H  -5.086781 0.615212 0.374828
H  -5.236167 3.066312 0.627233
H  -3.252378 4.485764 0.232403
H  0.728461 3.161982 1.492306
H  0.155733 3.051423 -2.743477
H  3.02924 2.299168 1.206329
H  2.451906 2.168227 -3.030888
H  3.889121 1.785892 -1.050834
totalener: -2050.65542063 hartree
nucrepener: 2970.65669748 hartree
electener: -5021.31211811 hartree
oneelecener: -8716.33732654 hartree
twoeener: 3695.02520843 hartree
kineticenergy: 2044.53874721 hartree
xcener: -151.875982974613 hartree
chargesum: -0.0000000
charge: -0.032010 -0.046094 -0.284899 -0.340097 -0.295617 -0.001890 0.131266 0.005194 -0.160708 -0.252286 -0.275732 -0.294974 0.359194 0.134369 0.269231 0.069193 -0.259104 -0.151876 -0.218348 0.264894 -0.068170 -0.214217 0.214383 -0.140624 -0.136922 -0.145862 -0.146678 -0.117128 0.102135 0.111447 0.086248 0.091703 0.100663 0.088403 0.092359 0.100857 0.116496 0.135736 0.086154 0.115476 0.127241 0.126457 0.129718 0.129692 0.139093 0.128534 0.127101
qa: -0.0320 -0.0461 -0.2849 -0.3401 -0.2956 -0.0019 0.1313 0.0052 -0.1607 -0.2523 -0.2757 -0.2950 0.3592 0.1344 0.2692 0.0692 -0.2591 -0.1519 -0.2183 0.2649 -0.0682 -0.2142 0.2144 -0.1406 -0.1369 -0.1459 -0.1467 -0.1171 0.1021 0.1114 0.0862 0.0917 0.1007 0.0884 0.0924 0.1009 0.1165 0.1357 0.0862 0.1155 0.1272 0.1265 0.1297 0.1297 0.1391 0.1285 0.1271
va: 1.2970 1.2614 2.0726 2.1743 2.1231 3.1146 3.7162 3.7786 3.8725 3.9168 3.9251 3.9049 4.2135 4.1786 3.7800 3.7534 3.9851 3.9501 4.0520 3.8347 3.9486 4.0438 3.8360 3.9986 3.9644 3.8738 3.9337 3.8572 1.0123 1.0224 1.0043 1.0136 1.0012 1.0002 1.0014 1.0053 1.0223 1.0375 1.0405 1.0109 0.9987 1.0149 1.0101 1.0078 1.0105 1.0000 1.0058
dispcorr: -0.030471528 hartree
energy: -2050.685892157655
dipole: -4.98172 6.26804 1.28632 -8.32183 8.48502 0.16319 -17.55147 17.60130 0.04983
magnitude: 1.29759 au
magnitude: 3.29820 debye
