program: Orca
programVersion: 5.0.2
elementType: Cl Cl O O O N C C C C C C C C C C C C C C C C C C C C C C H H H H H H H H H H H H H H H H H H H
charge: 0
multiplicity: 1
keywords: wb97x-d3
keywords: def2-TZVPP
keywords: def2/J RIJCOSX
keywords: DEFGRID2
keywords: scfconv7
keywords: smallprint printgap noloewdin
keywords: NOSOSCF
formula: C22H19Cl2NO3
InChI: InChI=1/C22H19Cl2NO3/c1-22(2)17(12-19(23)24)20(22)21(26)28-18(13-25)14-7-6-10-16(11-14)27-15-8-4-3-5-9-15/h3-12,17-18,20H,1-2H3
47 atoms
Cl 2.09145 -5.55909 1.183136
Cl 2.541776 -6.522658 -1.497578
O  -1.46189 -0.71235 -0.971966
O  -0.663377 -1.15624 1.075389
O  -1.179148 3.811461 2.026048
N  -4.61369 -0.822916 -1.94446
C  2.04169 -1.453574 -0.464544
C  1.460618 -2.812052 -0.207557
C  0.607731 -1.744147 -0.864329
C  2.35122 -0.580497 0.728038
C  3.014535 -1.258996 -1.603502
C  1.839798 -3.994567 -0.992541
C  -0.539488 -1.189817 -0.118652
C  2.11603 -5.193639 -0.494308
C  -2.624202 -0.101153 -0.413136
C  -2.45104 1.396685 -0.351764
C  -3.737168 -0.504948 -1.274231
C  -1.899347 1.953385 0.795241
C  -2.763543 2.20411 -1.436933
C  -1.668481 3.319686 0.856692
C  -2.532704 3.568554 -1.361328
C  -1.987358 4.135973 -0.222016
C  -0.247702 4.810107 2.018166
C  -0.355441 5.782872 3.001339
C  0.804618 4.83692 1.111118
C  0.599023 6.784755 3.07917
C  1.74596 5.85135 1.194784
C  1.649543 6.828174 2.174835
H  1.212743 -3.003554 0.830141
H  0.439357 -1.844864 -1.930507
H  2.245251 0.47589 0.474146
H  3.385248 -0.74341 1.03604
H  1.714692 -0.784393 1.584641
H  2.755235 -1.82903 -2.494902
H  4.019187 -1.558532 -1.300975
H  3.052681 -0.20738 -1.891384
H  1.894246 -3.898388 -2.069832
H  -2.815129 -0.49515 0.589328
H  -1.644163 1.333328 1.645038
H  -3.197797 1.780152 -2.332836
H  -2.789228 4.202558 -2.198907
H  -1.821655 5.204213 -0.170341
H  -1.179763 5.744561 3.701127
H  0.896126 4.071665 0.350842
H  0.514184 7.53989 3.849246
H  2.566492 5.87064 0.489761
H  2.389924 7.613984 2.23562
totalener: -2050.66177587 hartree
nucrepener: 2678.25211935 hartree
electener: -4728.91389522 hartree
oneelecener: -8131.54502441 hartree
twoeener: 3402.63112919 hartree
kineticenergy: 2044.52882236 hartree
xcener: -151.870220839961 hartree
chargesum: 0.0000000
charge: -0.038067 -0.042702 -0.255543 -0.385813 -0.295228 -0.003648 0.067057 0.041269 -0.101330 -0.247909 -0.239271 -0.200999 0.368757 0.049367 0.307909 -0.003124 -0.250544 -0.168891 -0.161042 0.190187 -0.111053 -0.146235 0.241954 -0.207281 -0.159521 -0.091086 -0.118877 -0.142485 0.089420 0.081366 0.085260 0.090722 0.104300 0.072937 0.099016 0.093876 0.098157 0.126736 0.133433 0.122765 0.132702 0.137198 0.127375 0.127851 0.127222 0.127025 0.126786
qa: -0.0381 -0.0427 -0.2555 -0.3858 -0.2952 -0.0036 0.0671 0.0413 -0.1013 -0.2479 -0.2393 -0.2010 0.3688 0.0494 0.3079 -0.0031 -0.2505 -0.1689 -0.1610 0.1902 -0.1111 -0.1462 0.2420 -0.2073 -0.1595 -0.0911 -0.1189 -0.1425 0.0894 0.0814 0.0853 0.0907 0.1043 0.0729 0.0990 0.0939 0.0982 0.1267 0.1334 0.1228 0.1327 0.1372 0.1274 0.1279 0.1272 0.1270 0.1268
va: 1.2892 1.2624 2.1276 2.1143 2.1081 3.1133 3.7514 3.8270 3.8839 3.9161 3.9095 3.9170 4.2189 4.2519 3.8182 3.7405 4.0193 4.0069 4.0347 3.9079 3.9614 3.9550 3.8023 4.0358 3.9337 3.9395 3.9523 3.9620 1.0478 1.0366 1.0026 1.0024 1.0202 1.0103 1.0032 1.0039 1.0296 1.0219 1.0306 1.0189 1.0007 1.0020 1.0137 1.0053 0.9986 0.9999 1.0001
dispcorr: -0.022926805 hartree
energy: -2050.684702673860
dipole: 5.42210 -3.93954 1.48256 43.41760 -41.77059 1.64701 0.50111 -0.63874 -0.13762
magnitude: 2.22026 au
magnitude: 5.64346 debye
