program: Orca
programVersion: 5.0.2
elementType: Cl Cl O O O N C C C C C C C C C C C C C C C C C C C C C C H H H H H H H H H H H H H H H H H H H
charge: 0
multiplicity: 1
keywords: wb97x-d3
keywords: def2-TZVPP
keywords: def2/J RIJCOSX
keywords: DEFGRID2
keywords: scfconv7
keywords: smallprint printgap noloewdin
keywords: NOSOSCF
formula: C22H19Cl2NO3
InChI: InChI=1/C22H19Cl2NO3/c1-22(2)17(12-19(23)24)20(22)21(26)28-18(13-25)14-7-6-10-16(11-14)27-15-8-4-3-5-9-15/h3-12,17-18,20H,1-2H3
47 atoms
Cl 2.633848 -5.122349 0.10735
Cl 3.92093 -4.69124 -2.437641
O  -1.520979 -0.347143 -0.824958
O  -1.058291 -1.647562 0.948181
O  -1.505381 4.450472 0.539328
N  -4.394166 -1.173001 -2.296469
C  1.871088 -0.736459 0.233363
C  1.646975 -2.152997 -0.205271
C  0.662091 -1.07941 -0.618382
C  1.713785 -0.422957 1.700952
C  2.931112 0.106227 -0.436239
C  2.47609 -2.793213 -1.234627
C  -0.700129 -1.092376 -0.051199
C  2.940544 -4.035909 -1.187023
C  -2.864868 -0.184159 -0.420543
C  -3.18238 1.276435 -0.160046
C  -3.71205 -0.736853 -1.48222
C  -2.158511 2.185087 0.057615
C  -4.507957 1.686445 -0.088081
C  -2.46873 3.506856 0.356669
C  -4.8007 3.009435 0.19909
C  -3.788289 3.925989 0.42856
C  -0.315722 4.094896 1.110153
C  -0.270689 3.444238 2.337373
C  0.853519 4.450417 0.45602
C  0.958415 3.15739 2.908742
C  2.078119 4.162025 1.041627
C  2.136602 3.512812 2.265432
H  1.284896 -2.812475 0.575099
H  0.712672 -0.737765 -1.646094
H  2.677886 -0.5383 2.199013
H  1.00293 -1.073512 2.203827
H  1.391883 0.610108 1.842911
H  3.914486 -0.116837 -0.019565
H  2.728527 1.165132 -0.267569
H  2.986182 -0.046453 -1.513466
H  2.741918 -2.215257 -2.111091
H  -3.05546 -0.762062 0.490865
H  -1.122956 1.883077 -0.017626
H  -5.312927 0.985035 -0.267165
H  -5.832311 3.330354 0.249298
H  -4.011242 4.960086 0.65473
H  -1.18727 3.172919 2.845613
H  0.798517 4.959232 -0.497316
H  0.993884 2.656617 3.867273
H  2.990384 4.447529 0.534625
H  3.092526 3.289974 2.719384
totalener: -2050.66035326 hartree
nucrepener: 2777.69606388 hartree
electener: -4828.35641714 hartree
oneelecener: -8330.16864635 hartree
twoeener: 3501.81222921 hartree
kineticenergy: 2044.52278833 hartree
xcener: -151.872555940977 hartree
chargesum: 0.0000000
charge: -0.038062 -0.043380 -0.280466 -0.362732 -0.296981 -0.001553 0.094949 0.037966 -0.105176 -0.227032 -0.247973 -0.204067 0.338606 0.051648 0.336182 0.030566 -0.254609 -0.149679 -0.202839 0.213764 -0.083700 -0.199729 0.209018 -0.132272 -0.181441 -0.126804 -0.117666 -0.149058 0.087551 0.083259 0.092678 0.106483 0.056347 0.099725 0.089941 0.074712 0.097143 0.132043 0.125646 0.121738 0.129509 0.128998 0.134936 0.130250 0.138413 0.131687 0.131462
qa: -0.0381 -0.0434 -0.2805 -0.3627 -0.2970 -0.0016 0.0949 0.0380 -0.1052 -0.2270 -0.2480 -0.2041 0.3386 0.0516 0.3362 0.0306 -0.2546 -0.1497 -0.2028 0.2138 -0.0837 -0.1997 0.2090 -0.1323 -0.1814 -0.1268 -0.1177 -0.1491 0.0876 0.0833 0.0927 0.1065 0.0563 0.0997 0.0899 0.0747 0.0971 0.1320 0.1256 0.1217 0.1295 0.1290 0.1349 0.1302 0.1384 0.1317 0.1315
va: 1.2895 1.2618 2.1061 2.1454 2.1109 3.1110 3.7171 3.8677 3.8671 3.8943 3.9159 3.9273 4.2378 4.2510 3.7714 3.7611 4.0026 3.9183 4.0497 3.8515 3.9597 4.0394 3.8381 3.9223 4.0129 3.8764 3.8871 3.8830 1.0499 1.0367 1.0034 1.0250 1.0210 1.0021 1.0065 1.0117 1.0308 1.0275 1.0181 1.0169 0.9993 1.0119 1.0033 1.0113 0.9976 0.9977 1.0000
dispcorr: -0.025893519 hartree
energy: -2050.686246776733
dipole: -2.88102 3.96729 1.08627 34.85571 -33.31680 1.53892 14.44061 -13.48456 0.95605
magnitude: 2.11241 au
magnitude: 5.36933 debye
