program: Orca
programVersion: 5.0.2
elementType: Cl Cl O O O N C C C C C C C C C C C C C C C C C C C C C C H H H H H H H H H H H H H H H H H H H
charge: 0
multiplicity: 1
keywords: wb97x-d3
keywords: def2-TZVPP
keywords: def2/J RIJCOSX
keywords: DEFGRID2
keywords: scfconv7
keywords: smallprint printgap noloewdin
keywords: NOSOSCF
formula: C22H19Cl2NO3
InChI: InChI=1/C22H19Cl2NO3/c1-22(2)17(12-19(23)24)20(22)21(26)28-18(13-25)14-7-6-10-16(11-14)27-15-8-4-3-5-9-15/h3-12,17-18,20H,1-2H3
47 atoms
Cl 1.930033 -3.3380 -2.49234
Cl 3.809145 -5.421379 -1.813168
O  -0.218055 -0.572747 -0.390051
O  -1.718161 -2.23087 -0.539269
O  -1.505753 4.184474 2.112429
N  0.219379 1.860837 -2.587805
C  0.212969 -3.650423 1.478328
C  0.437106 -4.151549 0.091727
C  0.458939 -2.663216 0.347309
C  -1.154286 -3.795288 2.100106
C  1.339346 -3.767083 2.477491
C  1.682274 -4.849734 -0.29504
C  -0.622624 -1.843995 -0.231006
C  2.380504 -4.569671 -1.387351
C  -1.149803 0.344863 -0.959354
C  -1.853914 1.133387 0.118664
C  -0.37465 1.1934 -1.866333
C  -1.32519 2.329371 0.584338
C  -3.019077 0.616318 0.672671
C  -1.977058 3.018705 1.599407
C  -3.64615 1.302453 1.70071
C  -3.136643 2.503726 2.163514
C  -0.822061 5.055308 1.306921
C  0.367207 5.578882 1.788224
C  -1.320748 5.447305 0.07099
C  1.06159 6.505992 1.025181
C  -0.610317 6.364304 -0.686344
C  0.580548 6.897889 -0.214464
H  -0.455454 -4.4990 -0.423256
H  1.430069 -2.182649 0.359771
H  -1.335959 -3.001198 2.826174
H  -1.213451 -4.746553 2.631755
H  -1.958696 -3.773881 1.369663
H  1.317045 -4.742284 2.967785
H  1.24254 -3.006158 3.252839
H  2.321277 -3.648604 2.018741
H  2.037187 -5.659818 0.33146
H  -1.889296 -0.193617 -1.559479
H  -0.416797 2.731845 0.152176
H  -3.430471 -0.315055 0.3077
H  -4.553247 0.905916 2.136635
H  -3.631769 3.051009 2.954753
H  0.739402 5.262634 2.753757
H  -2.253155 5.040455 -0.299215
H  1.98955 6.915849 1.401123
H  -0.994878 6.664358 -1.651924
H  1.129312 7.613693 -0.810995
totalener: -2050.66034997 hartree
nucrepener: 2728.26542148 hartree
electener: -4778.92577144 hartree
oneelecener: -8232.19196662 hartree
twoeener: 3453.26619518 hartree
kineticenergy: 2044.54115527 hartree
xcener: -151.872663467091 hartree
chargesum: -0.0000000
charge: -0.026685 -0.039530 -0.252975 -0.392586 -0.297588 -0.002648 0.116722 -0.013404 -0.168649 -0.255445 -0.267572 -0.253791 0.391887 0.096065 0.315815 0.003599 -0.255335 -0.174576 -0.155873 0.203418 -0.099284 -0.191024 0.225915 -0.201390 -0.151250 -0.092693 -0.102677 -0.137194 0.109236 0.109102 0.090943 0.086943 0.102028 0.092871 0.097344 0.088937 0.119246 0.126755 0.131544 0.134415 0.128189 0.128794 0.124558 0.130199 0.124960 0.126672 0.126013
qa: -0.0267 -0.0395 -0.2530 -0.3926 -0.2976 -0.0026 0.1167 -0.0134 -0.1686 -0.2554 -0.2676 -0.2538 0.3919 0.0961 0.3158 0.0036 -0.2553 -0.1746 -0.1559 0.2034 -0.0993 -0.1910 0.2259 -0.2014 -0.1512 -0.0927 -0.1027 -0.1372 0.1092 0.1091 0.0909 0.0869 0.1020 0.0929 0.0973 0.0889 0.1192 0.1268 0.1315 0.1344 0.1282 0.1288 0.1246 0.1302 0.1250 0.1267 0.1260
va: 1.3070 1.2661 2.1240 2.1072 2.1113 3.1128 3.7207 3.8363 3.9011 3.9021 3.9154 3.9083 4.1521 4.2049 3.8204 3.7209 4.0246 3.9758 3.9583 3.8879 3.9591 4.0337 3.8204 4.0416 3.9557 3.9356 3.9548 3.9635 1.0259 1.0241 1.0017 1.0032 1.0193 1.0015 1.0061 1.0006 1.0176 1.0220 1.0165 1.0193 1.0001 1.0116 1.0132 1.0035 0.9992 1.0003 1.0003
dispcorr: -0.024223734 hartree
energy: -2050.684573700396
dipole: -16.75315 16.29884 -0.45431 15.21300 -15.75365 -0.54065 25.45118 -23.98080 1.47038
magnitude: 1.63117 au
magnitude: 4.14611 debye
