program: Orca
programVersion: 5.0.2
elementType: Cl Cl O O O N C C C C C C C C C C C C C C C C C C C C C C H H H H H H H H H H H H H H H H H H H
charge: 0
multiplicity: 1
keywords: wb97x-d3
keywords: def2-TZVPP
keywords: def2/J RIJCOSX
keywords: DEFGRID2
keywords: scfconv7
keywords: smallprint printgap noloewdin
keywords: NOSOSCF
formula: C22H19Cl2NO3
InChI: InChI=1/C22H19Cl2NO3/c1-22(2)17(12-19(23)24)20(22)21(26)28-18(13-25)14-7-6-10-16(11-14)27-15-8-4-3-5-9-15/h3-12,17-18,20H,1-2H3
47 atoms
Cl 1.234988 -4.191835 1.542486
Cl 2.219769 -6.636039 0.366895
O  -0.931265 -1.014223 0.185975
O  1.123944 -0.192877 -0.142192
O  -0.891874 4.722902 -0.868582
N  -3.186439 -0.523114 2.553941
C  1.230409 -2.363499 -2.404284
C  1.916424 -2.874737 -1.181916
C  0.516605 -2.320039 -1.062953
C  1.73819 -1.100567 -3.055458
C  0.67202 -3.361247 -3.391261
C  2.158331 -4.318934 -0.969652
C  0.316589 -1.063851 -0.315886
C  1.904769 -4.96042 0.163311
C  -1.277664 0.160714 0.905606
C  -1.730391 1.26553 -0.017939
C  -2.351496 -0.23562 1.819631
C  -1.085078 2.490852 0.016027
C  -2.778268 1.042637 -0.90355
C  -1.504413 3.509962 -0.832174
C  -3.172423 2.058485 -1.756904
C  -2.546296 3.294996 -1.721952
C  -0.420442 5.273204 0.292159
C  -1.227002 5.389667 1.417481
C  0.875717 5.763652 0.296696
C  -0.722513 6.005353 2.551757
C  1.36519 6.38518 1.436091
C  0.57198 6.50582 2.567027
H  2.687658 -2.222532 -0.778519
H  -0.282426 -3.042468 -0.944192
H  2.486509 -1.355504 -3.807837
H  2.196458 -0.411916 -2.350771
H  0.928418 -0.572792 -3.561679
H  0.293475 -4.262994 -2.909358
H  1.439101 -3.663446 -4.106878
H  -0.149179 -2.918892 -3.956636
H  2.597266 -4.89144 -1.778577
H  -0.433293 0.506233 1.510526
H  -0.252103 2.647956 0.690103
H  -3.285728 0.086794 -0.925045
H  -3.987353 1.894541 -2.448993
H  -2.857821 4.094902 -2.380552
H  -2.241128 5.010296 1.406181
H  1.488979 5.661797 -0.588988
H  -1.351119 6.099849 3.427445
H  2.376075 6.771011 1.43865
H  0.957935 6.988939 3.454342
totalener: -2050.65957466 hartree
nucrepener: 2730.80845963 hartree
electener: -4781.46803430 hartree
oneelecener: -8237.10934349 hartree
twoeener: 3455.64130919 hartree
kineticenergy: 2044.53888433 hartree
xcener: -151.870209466293 hartree
chargesum: -0.0000000
charge: -0.028164 -0.039140 -0.260423 -0.378382 -0.298568 -0.001128 0.111673 -0.016700 -0.160263 -0.246962 -0.269317 -0.246765 0.370874 0.092488 0.314809 0.011251 -0.253701 -0.090320 -0.191882 0.180192 -0.095692 -0.183641 0.208455 -0.141946 -0.192962 -0.120358 -0.097327 -0.135441 0.109024 0.107866 0.085727 0.102892 0.090496 0.088842 0.093467 0.096496 0.118898 0.117044 0.119082 0.124124 0.129268 0.130043 0.135192 0.127056 0.129797 0.126763 0.127264
qa: -0.0282 -0.0391 -0.2604 -0.3784 -0.2986 -0.0011 0.1117 -0.0167 -0.1603 -0.2470 -0.2693 -0.2468 0.3709 0.0925 0.3148 0.0113 -0.2537 -0.0903 -0.1919 0.1802 -0.0957 -0.1836 0.2085 -0.1419 -0.1930 -0.1204 -0.0973 -0.1354 0.1090 0.1079 0.0857 0.1029 0.0905 0.0888 0.0935 0.0965 0.1189 0.1170 0.1191 0.1241 0.1293 0.1300 0.1352 0.1271 0.1298 0.1268 0.1273
va: 1.3050 1.2665 2.1264 2.1265 2.1057 3.1203 3.7307 3.8467 3.8895 3.9015 3.9162 3.9073 4.1693 4.2061 3.8485 3.6589 4.0212 3.9050 4.0285 3.8920 3.9458 4.0301 3.8361 3.9485 4.0331 3.9526 3.9369 3.9554 1.0256 1.0243 1.0023 1.0207 1.0019 1.0005 1.0017 1.0062 1.0172 1.0236 1.0189 1.0171 0.9991 1.0109 1.0030 1.0127 0.9996 0.9989 0.9998
dispcorr: -0.024071814 hartree
energy: -2050.683646478089
dipole: -2.31085 3.04548 0.73463 29.97109 -29.54298 0.42811 -19.93593 18.48029 -1.45564
magnitude: 1.68577 au
magnitude: 4.28489 debye
