program: Orca
programVersion: 5.0.2
elementType: Cl Cl O O O N C C C C C C C C C C C C C C C C C C C C C C H H H H H H H H H H H H H H H H H H H
charge: 0
multiplicity: 1
keywords: wb97x-d3
keywords: def2-TZVPP
keywords: def2/J RIJCOSX
keywords: DEFGRID2
keywords: scfconv7
keywords: smallprint printgap noloewdin
keywords: NOSOSCF
formula: C22H19Cl2NO3
InChI: InChI=1/C22H19Cl2NO3/c1-22(2)17(12-19(23)24)20(22)21(26)28-18(13-25)14-7-6-10-16(11-14)27-15-8-4-3-5-9-15/h3-12,17-18,20H,1-2H3
47 atoms
Cl 1.659541 -5.47842 0.489297
Cl 3.732727 -5.286702 -1.506762
O  -1.196912 -0.203127 -1.357691
O  -1.409623 -1.451671 0.485789
O  -1.721228 4.39357 0.887484
N  -3.28266 0.897488 -3.68591
C  1.701968 -0.995936 0.638328
C  1.399866 -2.367763 0.114608
C  0.743997 -1.158875 -0.525457
C  1.195126 -0.644577 2.0153
C  3.022027 -0.337287 0.313068
C  2.374624 -3.149208 -0.655976
C  -0.714094 -0.983574 -0.371716
C  2.558384 -4.460593 -0.561332
C  -2.584785 0.084243 -1.303053
C  -2.920067 1.144411 -0.279425
C  -2.95173 0.536794 -2.647033
C  -2.117899 2.271047 -0.166173
C  -4.049974 1.001908 0.510973
C  -2.45237 3.252728 0.756216
C  -4.386059 2.000877 1.411113
C  -3.588433 3.124811 1.543917
C  -0.357701 4.325014 0.907798
C  0.340912 5.325461 0.248043
C  0.320311 3.332876 1.605849
C  1.726672 5.332472 0.289462
C  1.706283 3.350208 1.634178
C  2.416013 4.344266 0.976346
H  0.732801 -2.948276 0.741557
H  1.132365 -0.841727 -1.486682
H  0.268914 -1.151122 2.27383
H  1.024274 0.430046 2.098361
H  1.944389 -0.919352 2.759456
H  2.937119 0.745087 0.421221
H  3.361502 -0.530609 -0.703712
H  3.800918 -0.684943 0.993566
H  3.004725 -2.627451 -1.365411
H  -3.158393 -0.823407 -1.086831
H  -1.242118 2.390025 -0.792649
H  -4.6639 0.114401 0.428394
H  -5.26819 1.895672 2.027927
H  -3.837582 3.904331 2.251496
H  -0.203493 6.092301 -0.287092
H  -0.227278 2.561115 2.132313
H  2.269176 6.114875 -0.224374
H  2.234416 2.584427 2.188077
H  3.497053 4.352683 1.005881
totalener: -2050.66037742 hartree
nucrepener: 2780.98533546 hartree
electener: -4831.64571287 hartree
oneelecener: -8336.79897455 hartree
twoeener: 3505.15326168 hartree
kineticenergy: 2044.53290935 hartree
xcener: -151.871849926280 hartree
chargesum: 0.0000000
charge: -0.038074 -0.043300 -0.272549 -0.363640 -0.298873 0.002124 0.093291 0.031376 -0.074876 -0.241753 -0.250067 -0.203787 0.323761 0.051955 0.311456 0.063963 -0.254092 -0.162876 -0.152201 0.181893 -0.093349 -0.188972 0.224372 -0.204866 -0.135391 -0.086186 -0.150718 -0.146607 0.086465 0.083406 0.109046 0.050055 0.097227 0.089063 0.075253 0.100686 0.097649 0.125440 0.134368 0.107258 0.129057 0.131408 0.129082 0.137285 0.127876 0.140098 0.127261
qa: -0.0381 -0.0433 -0.2725 -0.3636 -0.2989 0.0021 0.0933 0.0314 -0.0749 -0.2418 -0.2501 -0.2038 0.3238 0.0520 0.3115 0.0640 -0.2541 -0.1629 -0.1522 0.1819 -0.0933 -0.1890 0.2244 -0.2049 -0.1354 -0.0862 -0.1507 -0.1466 0.0865 0.0834 0.1090 0.0501 0.0972 0.0891 0.0753 0.1007 0.0976 0.1254 0.1344 0.1073 0.1291 0.1314 0.1291 0.1373 0.1279 0.1401 0.1273
va: 1.2896 1.2617 2.1199 2.1401 2.1107 3.1203 3.7142 3.8572 3.8573 3.9075 3.9133 3.9272 4.2619 4.2534 3.8388 3.6478 4.0208 3.9406 4.0383 3.8724 3.9553 4.0421 3.8524 4.0392 3.8974 3.9431 3.9276 3.9791 1.0516 1.0350 1.0241 1.0199 1.0024 1.0120 1.0130 1.0010 1.0318 1.0198 1.0207 1.0129 0.9997 1.0099 1.0128 1.0007 0.9979 0.9889 1.0014
dispcorr: -0.025777838 hartree
energy: -2050.686155253514
dipole: -0.33440 1.20767 0.87327 33.88319 -33.34676 0.53642 13.76401 -12.51854 1.24548
magnitude: 1.61294 au
magnitude: 4.09976 debye
