program: Orca
programVersion: 5.0.2
elementType: Cl Cl O O O N C C C C C C C C C C C C C C C C C C C C C C H H H H H H H H H H H H H H H H H H H
charge: 0
multiplicity: 1
keywords: wb97x-d3
keywords: def2-TZVPP
keywords: def2/J RIJCOSX
keywords: DEFGRID2
keywords: scfconv7
keywords: smallprint printgap noloewdin
keywords: NOSOSCF
formula: C22H19Cl2NO3
InChI: InChI=1/C22H19Cl2NO3/c1-22(2)17(12-19(23)24)20(22)21(26)28-18(13-25)14-7-6-10-16(11-14)27-15-8-4-3-5-9-15/h3-12,17-18,20H,1-2H3
47 atoms
Cl 1.632095 0.008357 2.087623
Cl 4.441237 -0.254861 1.485152
O  -1.61999 -1.38366 0.069257
O  -1.748374 -2.700208 1.877543
O  -0.778858 3.477568 -0.282488
N  -4.580687 -2.383912 -1.105205
C  0.753028 -3.266028 -0.647542
C  1.156107 -1.869711 -0.302231
C  0.280718 -2.642073 0.65526
C  -0.206445 -3.490119 -1.79103
C  1.764283 -4.376234 -0.489924
C  2.539518 -1.518513 0.086456
C  -1.11991 -2.276627 0.950996
C  2.831825 -0.700806 1.087866
C  -2.930266 -0.896392 0.276142
C  -2.98112 0.560083 -0.139773
C  -3.860744 -1.727221 -0.497095
C  -1.833457 1.332344 -0.026889
C  -4.171585 1.135519 -0.563647
C  -1.874731 2.677277 -0.370875
C  -4.20457 2.487039 -0.872108
C  -3.061505 3.263091 -0.787929
C  0.458023 2.951895 -0.541227
C  1.48355 3.243485 0.342925
C  0.69902 2.186187 -1.676216
C  2.760371 2.762253 0.09159
C  1.976941 1.704892 -1.910646
C  3.011538 1.987389 -1.029497
H  0.653816 -1.087659 -0.866506
H  0.767512 -3.038888 1.538724
H  -0.873235 -2.648794 -1.963986
H  -0.821478 -4.374005 -1.615256
H  0.352523 -3.657982 -2.713131
H  1.261311 -5.329404 -0.322343
H  2.441229 -4.208511 0.348089
H  2.369435 -4.477307 -1.393089
H  3.361919 -1.907937 -0.50228
H  -3.20544 -0.990824 1.332554
H  -0.905254 0.897013 0.318387
H  -5.069978 0.540289 -0.663821
H  -5.130916 2.937191 -1.202507
H  -3.079019 4.313309 -1.046931
H  1.278759 3.83954 1.222335
H  -0.101915 1.971274 -2.372263
H  3.558921 2.982906 0.787032
H  2.164961 1.111262 -2.795782
H  4.006038 1.60551 -1.215189
totalener: -2050.65622602 hartree
nucrepener: 2987.79375940 hartree
electener: -5038.44998542 hartree
oneelecener: -8750.62868497 hartree
twoeener: 3712.17869955 hartree
kineticenergy: 2044.53954705 hartree
xcener: -151.877749073479 hartree
chargesum: 0.0000000
charge: -0.037570 -0.050115 -0.274982 -0.336014 -0.298148 -0.000556 0.118367 0.001140 -0.132129 -0.250150 -0.278778 -0.283590 0.351000 0.152848 0.300100 0.035182 -0.258874 -0.145028 -0.188804 0.236425 -0.079102 -0.207847 0.265982 -0.210027 -0.154986 -0.119889 -0.155918 -0.115249 0.097003 0.106618 0.088265 0.104137 0.085978 0.101348 0.087597 0.092339 0.118878 0.129605 0.071797 0.122720 0.129442 0.128498 0.125432 0.134315 0.130394 0.131166 0.131179
qa: -0.0376 -0.0501 -0.2750 -0.3360 -0.2981 -0.0006 0.1184 0.0011 -0.1321 -0.2502 -0.2788 -0.2836 0.3510 0.1528 0.3001 0.0352 -0.2589 -0.1450 -0.1888 0.2364 -0.0791 -0.2078 0.2660 -0.2100 -0.1550 -0.1199 -0.1559 -0.1152 0.0970 0.1066 0.0883 0.1041 0.0860 0.1013 0.0876 0.0923 0.1189 0.1296 0.0718 0.1227 0.1294 0.1285 0.1254 0.1343 0.1304 0.1312 0.1312
va: 1.2970 1.2579 2.0778 2.1697 2.1177 3.1100 3.7431 3.7688 3.8759 3.9007 3.9225 3.8991 4.1936 4.1499 3.8024 3.7763 4.0006 3.9239 4.0204 3.8440 3.9570 4.0436 3.7527 4.0089 3.8987 3.8809 3.9042 3.8356 1.0181 1.0237 1.0172 1.0016 1.0037 1.0053 1.0013 1.0009 1.0184 1.0210 1.0531 1.0193 0.9993 1.0124 1.0130 1.0028 1.0051 0.9992 1.0031
dispcorr: -0.031469882 hartree
energy: -2050.687695903005
dipole: -5.74054 7.08266 1.34212 -9.73285 10.21430 0.48145 -18.06295 17.51087 -0.55208
magnitude: 1.52901 au
magnitude: 3.88644 debye
