program: Gaussian 09
title: 000072750
version: EM64L-G09RevD.01
frameworkgroup: C1[X(C22H26N2O8)]
method: RPBEPBE
basis: SDD
operation: Freq
keyword: #p
keyword: freq=noraman
keyword: PBEPBE/SDD
title: #p freq=noraman PBEPBE/SDD
converged: YES YES NO NO
title: Mulliken charges:
elementType: O O O O O O O O N N C C C C C C C C C C C C C C C C C C C C C C H H H H H H H H H H H H H H H H H H H H H H H H H H
charge: -0.479003 -0.363540 -0.397403 -0.395324 -0.306396 -0.288526 -0.445142 -0.491266 -0.388495 -0.389031 0.181903 0.090717 0.254353 0.264692 0.115265 0.193092 0.004555 -0.060541 -0.373109 -0.398046 0.078843 0.145577 -0.374752 -0.377653 -0.348529 -0.378789 -0.278071 -0.284363 -0.241012 -0.261917 -0.323573 -0.311110 0.240552 0.237548 0.420610 0.416779 0.207101 0.234075 0.201571 0.236344 0.260061 0.224014 0.204183 0.205206 0.199989 0.197152 0.396063 0.365281 0.197038 0.207382 0.242845 0.164172 0.210605 0.212814 0.198623 0.181476 0.349746 0.415364
chargesum: 0.00000
title: Mulliken charges with hydrogens summed into heavy atoms:
elementType: O O O O O O O O N N C C C C C C C C C C C C C C C C C C C C C C
charge: -0.479003 -0.363540 -0.001341 -0.030043 -0.306396 -0.288526 -0.095396 -0.075903 0.032115 0.027748 0.181903 0.090717 0.254353 0.264692 0.115265 0.193092 0.004555 -0.060541 -0.132557 -0.160498 0.078843 0.145577 0.066424 0.060262 -0.088467 -0.154776 0.131318 0.112779 0.163408 0.145100 0.099846 0.068988
polarizability: 4.23785138e+02 9.47912795e+00 4.85484488e+02 1.48170154e+01 2.49998498e+00 1.52421260e+02
1716.lowfreq: -3.0469 -0.0010 -0.0008 -0.0004 3.7819 5.3559 11.1044 18.5251 26.5658
frequency: 10.9086 18.5179 26.5316 35.8789 38.5994 42.2279 66.2305 70.4052 73.7340 86.8823 92.3342 102.2715 115.1389 133.9843 146.5158 154.0408 158.9379 176.9238 187.8880 199.3114 203.7187 232.1371 248.4752 252.4542 265.1251 283.7953 296.3598 304.4296 327.5320 349.3799 355.4699 357.8172 386.4130 391.0349 416.3850 424.6678 429.3149 443.2747 448.2861 455.7922 462.4093 472.4052 482.4136 499.3836 505.2489 508.1264 517.9884 521.7992 539.5129 593.5988 620.5849 635.5380 665.4628 703.0221 725.4370 727.4669 747.0072 753.0476 766.6039 782.6691 799.2277 809.8945 811.5169 815.5158 823.1860 841.7673 872.4380 876.9267 882.8585 891.2842 917.4174 922.2583 925.0187 929.7812 940.6977 951.8174 979.5091 984.1600 999.8702 1005.4653 1009.7251 1030.6811 1039.5937 1055.8543 1071.1832 1073.8398 1081.6302 1089.6477 1099.4935 1101.2845 1128.7357 1137.8356 1144.2613 1169.9946 1183.1433 1190.5349 1202.2937 1205.2544 1207.9312 1219.3483 1237.0948 1244.2077 1256.6792 1263.8411 1266.1880 1275.9893 1288.3508 1304.2703 1323.2064 1331.5781 1338.9359 1345.2720 1348.5126 1352.8068 1359.6953 1363.8779 1370.2278 1376.5876 1384.0954 1390.2247 1399.6771 1401.8002 1409.8485 1433.5983 1438.1472 1447.5231 1447.7988 1456.8235 1459.8781 1460.3433 1463.2161 1467.2493 1474.5433 1478.8474 1485.2540 1510.4994 1545.7759 1560.0687 1562.5541 1597.5818 1625.0428 1645.4134 2539.5501 2928.6621 2936.9617 2937.4637 2945.8116 2947.6441 2947.8098 2955.1457 2974.9875 2995.2071 2998.2562 3008.5137 3009.4732 3012.8616 3019.1428 3077.8176 3081.7006 3085.7346 3118.2828 3145.6346 3165.4457 3169.7324 3177.8326 3332.3543 3545.7338 3553.7419
redmass: 5.9174 6.3286 6.3729 3.7447 3.6879 6.4725 5.7941 5.5237 5.8702 4.5312 3.7405 4.2920 4.6496 5.0351 4.4031 5.5375 6.1120 5.3926 3.5250 7.1346 2.5487 3.1386 3.3454 3.3847 5.1317 4.9605 4.1861 2.9414 2.7825 4.4211 5.4625 3.2287 1.3523 2.5062 3.9455 7.7078 8.5282 2.2127 2.8544 2.9592 5.1879 3.3661 4.7454 6.2357 5.6866 2.6294 4.1074 3.7230 3.6085 3.2099 4.6280 4.4329 5.6827 6.5940 1.5445 2.3466 6.1139 4.0395 2.8586 2.1972 4.9789 1.5884 4.6627 1.8216 9.6805 2.7759 2.5805 1.2118 2.4834 2.5322 2.4093 1.1574 2.0638 1.3446 5.4668 1.3535 3.2733 3.5385 2.5600 2.3499 1.0650 3.2164 2.9532 2.7975 3.3460 2.9253 2.2695 1.7154 2.2368 2.4032 2.5367 2.4698 1.4849 1.6087 1.7946 1.2110 1.1611 1.1607 1.1637 1.2232 1.4678 1.5502 1.3367 1.6712 1.1429 3.9036 2.9395 2.0073 3.3463 1.1825 1.2675 2.1962 1.5125 1.6263 1.7562 1.3349 2.0673 1.2966 1.2447 4.7547 1.5089 1.1799 7.1995 5.7268 1.0974 1.8420 1.4866 1.1215 1.1874 1.0863 1.4300 1.4022 1.1207 1.0983 4.2904 3.8907 4.1952 3.9152 2.3850 3.5903 2.8002 6.8696 1.0717 1.0630 1.0600 1.0555 1.0549 1.0635 1.0636 1.0632 1.0713 1.1024 1.1034 1.1017 1.1034 1.0970 1.1024 1.0810 1.0954 1.0971 1.0901 1.0862 1.0816 1.0962 1.0949 1.0697 1.0653 1.0659
irintensity: 0.7014 0.6901 0.1846 3.6826 4.2720 4.4415 0.7488 2.1065 0.4345 0.2912 4.6726 0.3016 2.0549 0.1631 6.8917 7.4431 5.6273 6.0716 8.5571 0.9079 4.3997 2.6042 6.6495 1.0882 0.7957 9.3090 1.2627 9.8909 1.8095 0.7721 1.4640 0.3504 77.8085 21.4240 2.5133 2.3240 3.6199 70.6384 45.3788 28.5142 32.7159 5.3445 4.7546 25.9450 0.0698 3.4193 3.8509 15.4762 21.3475 1.5454 4.8894 9.2242 0.6374 5.6342 72.7586 51.3349 4.3945 16.1651 11.7081 3.7890 14.0660 28.6637 5.3400 82.4142 3.2289 4.8892 11.1447 50.6351 26.6811 5.3637 23.9026 76.8437 27.3012 0.5387 58.7073 1.5558 24.0499 7.5258 100.8771 14.8130 132.7615 54.7859 58.9494 34.1496 72.3111 21.4894 90.3417 7.6511 19.9037 25.2635 25.5694 17.7204 8.3034 43.1208 72.9682 12.3259 8.4977 8.4462 8.2929 25.9280 16.7868 54.2199 163.1008 26.9783 19.5069 239.8557 74.2393 134.7904 279.3664 36.5278 41.9047 47.5169 159.6767 66.1683 14.0380 21.1221 33.1015 7.1241 30.9652 34.8801 5.0350 23.1349 26.5940 36.5671 8.7974 25.9273 21.6855 8.6960 18.8909 6.0157 61.2854 163.1832 32.7593 10.7821 61.0395 6.2071 673.4312 42.8321 156.4336 220.8546 71.1246 113.0694 179.6925 47.1147 9.8705 18.7382 81.7043 143.7235 105.1935 113.0142 15.6942 100.0954 94.7433 74.5654 43.7180 134.6338 47.3773 40.4238 21.9366 42.0648 18.3219 8.7808 35.8844 21.2209 6.6547 855.3490 4.8914 66.7439
temp: 298.150 k
press: 1.00000 atm
elementType: 8 8 8 8 8 8 8 8 7 7 6 6 6 6 6 6 6 6 6 6 6 6 6 6 6 6 6 6 6 6 6 6 1 1 1 1 1 1 1 1 1 1 1 1 1 1 1 1 1 1 1 1 1 1 1 1 1 1
symmnumber: 1
zpe: 1197858.8 jmol-1
zpe.correction: 0.456240 hartree
zpe.thermalcorrener: 0.486730 hartree
zpe.thermalcorrenthalpy: 0.487674 hartree
zpe.thermalcorrgfe: 0.391992 hartree
zpe.sumelectzpe: -1562.851121 hartree
zpe.sumelectthermal: -1562.820631 hartree
zpe.sumelectthermalent: -1562.819687 hartree
zpe.sumelectthermalfe: -1562.915369 hartree
dipole: -0.7145 -5.5814 -0.7487
dipole: 5.6766
quadrupole: -198.2502 -151.1182 -194.1954
quadrupole: 6.1420 32.6179 -0.8405
quadrupole: -17.0623 30.0697 -13.0074 6.1420 32.6179 -0.8405
hfenergy: -1563.307361 hartree
pointgroup: C01 [X(C22H26N2O8)]
dipole: -0.1933342 -2.2225489 -0.1034455 debye
polarizability: 422.7778469|8.5766886|484.1337172|17.1181748|-25.8474498|154.7793208 unknown
InChI: InChI=1S/C22H26N2O8/c25-7-11-31-9-5-23-13-1-2-14(24-6-10-32-12-8-26)18-17(13)21(29)19-15(27)3-4-16(28)20(19)22(18)30/h1-4,23-28H,5-12H2
charge 0 multiplicity 1
58 atoms
O  -2.51205 0.811238 -0.542787
O  3.011009 0.436751 -0.248452
O  -2.417479 3.273019 -0.709045
O  3.180674 3.037759 -0.332151
O  -5.495342 -1.415845 0.092386
O  5.582058 -1.814398 -0.178189
O  -7.389163 -0.520281 2.011408
O  5.570031 1.36711 0.220412
N  -2.729621 -1.74257 -0.381847
N  2.883358 -2.066492 0.027644
C  -0.555403 -0.60176 -0.321548
C  0.885348 -0.680792 -0.230378
C  -1.362409 -1.800793 -0.26474
C  1.522459 -1.971528 -0.06445
C  -0.380316 1.913215 -0.497157
C  1.054248 1.848057 -0.406666
C  -1.186862 0.696315 -0.460313
C  1.711024 0.532936 -0.291384
C  -0.692654 -3.063659 -0.086411
C  0.687567 -3.144185 0.010265
C  -1.050086 3.180498 -0.620292
C  1.78966 3.07033 -0.433433
C  -3.631612 -2.891434 -0.3071
C  3.703605 -3.253842 0.249064
C  -0.286335 4.374644 -0.650451
C  1.109686 4.313583 -0.557274
C  -5.026073 -2.485728 -0.790511
C  5.060376 -2.775156 0.797122
C  -6.752736 -0.788775 -0.357777
C  6.620261 -0.902264 0.350411
C  -7.144656 0.187163 0.751591
C  6.06288 0.325228 1.101521
H  -1.283667 -3.981658 -0.020683
H  1.158101 -4.124709 0.132964
H  -3.121391 -0.775919 -0.416239
H  3.38066 -1.159207 -0.13816
H  -3.27198 -3.719631 -0.950348
H  -3.703757 -3.280459 0.731134
H  3.240008 -3.944864 0.980492
H  3.866463 -3.813461 -0.695951
H  -0.812582 5.328053 -0.745489
H  1.692793 5.243536 -0.579263
H  -5.712746 -3.358229 -0.747144
H  -4.978513 -2.120404 -1.83938
H  5.754664 -3.634902 0.910897
H  4.912303 -2.298119 1.789311
H  -2.767529 2.281413 -0.659237
H  3.56527 3.950993 -0.331498
H  -6.594864 -0.262478 -1.323727
H  -7.535416 -1.566844 -0.484325
H  7.161939 -0.548919 -0.543175
H  7.320913 -1.471382 1.002038
H  -8.091839 0.692634 0.500224
H  -6.347329 0.950147 0.869031
H  6.903038 0.775557 1.667309
H  5.294434 0.005535 1.841328
H  -6.583442 -1.071932 2.188237
H  4.610321 1.214503 -0.027713
