program: Orca
programVersion: 5.0.2
elementType: Cl Cl O O O N C C C C C C C C C C C C C C C C C C C C C C H H H H H H H H H H H H H H H H H H H
charge: 0
multiplicity: 1
keywords: wb97x-d3
keywords: def2-TZVPP
keywords: def2/J RIJCOSX
keywords: DEFGRID2
keywords: scfconv7
keywords: smallprint printgap noloewdin
keywords: NOSOSCF
formula: C22H19Cl2NO3
InChI: InChI=1/C22H19Cl2NO3/c1-22(2)17(12-19(23)24)20(22)21(26)28-18(13-25)14-7-6-10-16(11-14)27-15-8-4-3-5-9-15/h3-12,17-18,20H,1-2H3
47 atoms
Cl 3.578781 -1.191251 -2.092553
Cl 4.958304 -0.660324 0.389161
O  -2.19495 -1.292368 1.224746
O  -1.728687 -1.214197 -0.961206
O  -1.328709 3.639713 0.723889
N  -4.967611 -2.348265 -0.451711
C  0.548074 -3.210377 -0.106592
C  1.119792 -1.836552 -0.302999
C  -0.084868 -2.017797 0.588535
C  -0.133739 -3.87275 -1.277646
C  1.276786 -4.184436 0.787627
C  2.399968 -1.437044 0.305302
C  -1.386221 -1.471604 0.156169
C  3.499444 -1.147795 -0.37692
C  -3.476153 -0.744758 0.978316
C  -3.439872 0.674688 0.44663
C  -4.283635 -1.643187 0.143433
C  -2.405728 1.507155 0.845501
C  -4.447087 1.164485 -0.373329
C  -2.352796 2.812083 0.377119
C  -4.408396 2.484992 -0.792444
C  -3.357705 3.313459 -0.434824
C  -0.043982 3.190896 0.586407
C  0.893044 3.679753 1.484974
C  0.33857 2.318404 -0.426882
C  2.219938 3.295594 1.365477
C  1.668314 1.940748 -0.529311
C  2.614638 2.421252 0.364102
H  0.903914 -1.394522 -1.270035
H  0.088916 -1.965443 1.65783
H  -0.903208 -4.567362 -0.936402
H  0.6001 -4.446272 -1.845921
H  -0.600872 -3.165566 -1.957823
H  1.72155 -3.711747 1.662594
H  2.080106 -4.675938 0.236819
H  0.594174 -4.957778 1.142353
H  2.462521 -1.365183 1.384045
H  -3.948312 -0.737983 1.965499
H  -1.619795 1.147774 1.497943
H  -5.254231 0.523069 -0.701478
H  -5.194005 2.864535 -1.431599
H  -3.305256 4.335129 -0.786343
H  0.579505 4.360009 2.26588
H  -0.386001 1.935859 -1.134301
H  2.948201 3.679736 2.067632
H  1.965657 1.270808 -1.325317
H  3.648588 2.116506 0.278667
totalener: -2050.65775470 hartree
nucrepener: 2909.90887192 hartree
electener: -4960.56662662 hartree
oneelecener: -8595.09615853 hartree
twoeener: 3634.52953191 hartree
kineticenergy: 2044.54401782 hartree
xcener: -151.877991854742 hartree
chargesum: 0.0000000
charge: -0.040963 -0.043141 -0.285294 -0.348491 -0.301255 0.000549 0.092863 -0.026755 -0.066618 -0.250034 -0.231270 -0.142702 0.315252 0.011076 0.427631 0.003625 -0.280023 -0.225438 -0.164424 0.213883 -0.088928 -0.189558 0.257399 -0.216488 -0.172252 -0.093825 -0.126823 -0.147381 0.096431 0.078761 0.093166 0.089397 0.104379 0.072351 0.098587 0.096687 0.106752 0.123419 0.130487 0.120306 0.130178 0.128771 0.124778 0.137088 0.125038 0.134585 0.128227
qa: -0.0410 -0.0431 -0.2853 -0.3485 -0.3013 0.0005 0.0929 -0.0268 -0.0666 -0.2500 -0.2313 -0.1427 0.3153 0.0111 0.4276 0.0036 -0.2800 -0.2254 -0.1644 0.2139 -0.0889 -0.1896 0.2574 -0.2165 -0.1723 -0.0938 -0.1268 -0.1474 0.0964 0.0788 0.0932 0.0894 0.1044 0.0724 0.0986 0.0967 0.1068 0.1234 0.1305 0.1203 0.1302 0.1288 0.1248 0.1371 0.1250 0.1346 0.1282
va: 1.2840 1.2625 2.1131 2.1408 2.1126 3.1092 3.8171 3.8306 3.8724 3.9145 3.9021 3.8014 4.2312 4.2239 3.9115 3.7378 4.0487 3.9830 4.0094 3.8644 3.9597 4.0552 3.7804 4.0408 3.9029 3.9711 3.9068 3.9420 1.0353 1.0392 1.0026 1.0016 1.0210 1.0079 1.0044 1.0051 1.0238 0.9847 1.0187 1.0236 0.9998 1.0102 1.0139 1.0100 0.9986 1.0051 1.0149
dispcorr: -0.028997046 hartree
energy: -2050.686751750462
dipole: -14.46057 15.10013 0.63956 -5.64001 5.73075 0.09075 4.98412 -3.88016 1.10396
magnitude: 1.27906 au
magnitude: 3.25112 debye
