program: Orca
programVersion: 5.0.2
elementType: Cl Cl O O O N C C C C C C C C C C C C C C C C C C C C C C H H H H H H H H H H H H H H H H H H H
charge: 0
multiplicity: 1
keywords: wb97x-d3
keywords: def2-TZVPP
keywords: def2/J RIJCOSX
keywords: DEFGRID2
keywords: scfconv7
keywords: smallprint printgap noloewdin
keywords: NOSOSCF
formula: C22H19Cl2NO3
InChI: InChI=1/C22H19Cl2NO3/c1-22(2)17(12-19(23)24)20(22)21(26)28-18(13-25)14-7-6-10-16(11-14)27-15-8-4-3-5-9-15/h3-12,17-18,20H,1-2H3
47 atoms
Cl 2.638024 -4.849491 1.355992
Cl 4.238241 -4.855957 -1.045394
O  -1.44553 -0.383755 -1.310427
O  -1.500661 -1.62152 0.556728
O  -1.548852 4.004011 1.253338
N  -3.672483 0.577851 -3.554666
C  1.549063 -0.739883 0.533301
C  1.411294 -2.19961 0.205136
C  0.583607 -1.188126 -0.549083
C  1.029837 -0.265705 1.868697
C  2.764898 0.024406 0.066726
C  2.457684 -2.933492 -0.522432
C  -0.876234 -1.125236 -0.336588
C  3.029227 -4.060746 -0.117863
C  -2.824561 -0.102605 -1.177487
C  -3.108602 1.025838 -0.206775
C  -3.280677 0.276538 -2.517927
C  -2.135747 1.98012 0.059866
C  -4.368036 1.119186 0.361302
C  -2.437557 3.037262 0.908474
C  -4.658737 2.186982 1.197888
C  -3.703736 3.146851 1.474057
C  -0.306003 4.03546 0.681827
C  0.79197 3.746507 1.476435
C  -0.144599 4.397306 -0.64867
C  2.066511 3.82467 0.932973
C  1.132432 4.460421 -1.1838
C  2.240372 4.174201 -0.39776
H  0.862205 -2.777348 0.94044
H  0.894453 -0.956095 -1.562055
H  1.827734 -0.324592 2.610657
H  0.193238 -0.854887 2.236158
H  0.708743 0.776213 1.80884
H  3.595066 -0.123894 0.759221
H  2.545589 1.092499 0.028138
H  3.106525 -0.274775 -0.923512
H  2.796128 -2.536186 -1.471532
H  -3.376865 -0.996314 -0.866773
H  -1.155921 1.900443 -0.391174
H  -5.121148 0.369757 0.153375
H  -5.640677 2.269663 1.643746
H  -3.923874 3.978405 2.130162
H  0.645248 3.478309 2.514672
H  -1.009479 4.630265 -1.256705
H  2.925166 3.608194 1.554815
H  1.261151 4.741939 -2.220355
H  3.234891 4.233346 -0.818822
totalener: -2050.66022919 hartree
nucrepener: 2805.75555270 hartree
electener: -4856.41578189 hartree
oneelecener: -8386.41002644 hartree
twoeener: 3529.99424455 hartree
kineticenergy: 2044.52736657 hartree
xcener: -151.871841418495 hartree
chargesum: -0.0000000
charge: -0.038398 -0.043243 -0.277035 -0.352062 -0.292985 0.000823 0.090261 0.032828 -0.092118 -0.240658 -0.228966 -0.199294 0.306345 0.042256 0.297589 0.071437 -0.256689 -0.225707 -0.202263 0.291255 -0.069244 -0.217410 0.279230 -0.237158 -0.177732 -0.134383 -0.102203 -0.121365 0.090665 0.082478 0.093948 0.107855 0.071359 0.098664 0.080546 0.074012 0.099992 0.131180 0.126434 0.108238 0.127445 0.127217 0.137728 0.136969 0.135766 0.133449 0.132940
qa: -0.0384 -0.0432 -0.2770 -0.3521 -0.2930 0.0008 0.0903 0.0328 -0.0921 -0.2407 -0.2290 -0.1993 0.3063 0.0423 0.2976 0.0714 -0.2567 -0.2257 -0.2023 0.2913 -0.0692 -0.2174 0.2792 -0.2372 -0.1777 -0.1344 -0.1022 -0.1214 0.0907 0.0825 0.0939 0.1079 0.0714 0.0987 0.0805 0.0740 0.1000 0.1312 0.1264 0.1082 0.1274 0.1272 0.1377 0.1370 0.1358 0.1334 0.1329
va: 1.2893 1.2625 2.1014 2.1520 2.1291 3.1237 3.7424 3.8577 3.8612 3.8980 3.9022 3.9029 4.2808 4.2465 3.8305 3.7361 4.0075 3.9515 4.0747 3.7959 3.9450 4.0447 3.7399 3.9789 3.9856 3.8662 3.9283 3.8938 1.0465 1.0381 1.0032 1.0227 1.0117 1.0043 1.0172 1.0127 1.0272 1.0192 1.0250 1.0119 0.9990 1.0137 1.0069 1.0042 0.9978 0.9980 0.9983
dispcorr: -0.026834814 hartree
energy: -2050.687064008048
dipole: -5.92159 6.78912 0.86753 33.31716 -32.46239 0.85477 5.96219 -5.13888 0.82331
magnitude: 1.47006 au
magnitude: 3.73660 debye
