program: Orca
programVersion: 5.0.2
elementType: Cl Cl O O O N C C C C C C C C C C C C C C C C C C C C C C H H H H H H H H H H H H H H H H H H H
charge: 0
multiplicity: 1
keywords: wb97x-d3
keywords: def2-TZVPP
keywords: def2/J RIJCOSX
keywords: DEFGRID2
keywords: scfconv7
keywords: smallprint printgap noloewdin
keywords: NOSOSCF
formula: C22H19Cl2NO3
InChI: InChI=1/C22H19Cl2NO3/c1-22(2)17(12-19(23)24)20(22)21(26)28-18(13-25)14-7-6-10-16(11-14)27-15-8-4-3-5-9-15/h3-12,17-18,20H,1-2H3
47 atoms
Cl 1.74512 -5.828019 1.346091
Cl 2.903355 -6.65798 -1.162525
O  -1.356789 -0.768472 -1.406872
O  -1.309573 -1.757375 0.599082
O  -0.033826 3.951596 -0.068245
N  -3.655447 0.778431 -3.215787
C  1.780768 -1.696301 -0.159887
C  1.232009 -3.095096 -0.111963
C  0.517542 -2.043472 -0.924163
C  1.705309 -0.864905 1.097941
C  3.002258 -1.396397 -0.994926
C  1.885222 -4.214245 -0.803649
C  -0.793849 -1.545332 -0.462151
C  2.137987 -5.403423 -0.271062
C  -2.535392 -0.077605 -1.015846
C  -2.223564 1.078145 -0.094557
C  -3.14997 0.392284 -2.259537
C  -1.288419 2.02588 -0.485511
C  -2.862318 1.183605 1.131131
C  -0.989079 3.085009 0.359313
C  -2.563321 2.251285 1.962354
C  -1.628598 3.203034 1.589605
C  -0.008597 5.223709 0.438713
C  1.119665 5.637497 1.127796
C  -1.072266 6.091083 0.227965
C  1.184988 6.938072 1.607482
C  -0.998114 7.385023 0.717747
C  0.127488 7.812496 1.409005
H  0.739119 -3.351814 0.818845
H  0.629509 -2.080623 -2.002473
H  0.864593 -1.12935 1.734824
H  1.621469 0.196505 0.856459
H  2.617378 -1.002098 1.680665
H  3.021643 -1.938997 -1.939285
H  3.910748 -1.653439 -0.448118
H  3.044965 -0.33234 -1.231491
H  2.186664 -4.075148 -1.834605
H  -3.240853 -0.758088 -0.527687
H  -0.787973 1.956318 -1.444081
H  -3.577335 0.432959 1.441148
H  -3.053951 2.339333 2.922523
H  -1.398158 4.023413 2.256051
H  1.938694 4.946517 1.279601
H  -1.945023 5.757937 -0.319262
H  2.066105 7.264644 2.143808
H  -1.823571 8.064601 0.551888
H  0.180935 8.824721 1.786158
totalener: -2050.66077222 hartree
nucrepener: 2688.22134001 hartree
electener: -4738.88211223 hartree
oneelecener: -8151.68465669 hartree
twoeener: 3412.80254446 hartree
kineticenergy: 2044.53513041 hartree
xcener: -151.870119500808 hartree
chargesum: 0.0000000
charge: -0.039193 -0.044336 -0.262940 -0.357059 -0.297765 -0.000494 0.069574 0.041745 -0.075082 -0.246122 -0.241930 -0.205350 0.308783 0.049020 0.330245 0.045731 -0.262091 -0.239596 -0.130744 0.215608 -0.115793 -0.148203 0.194948 -0.174969 -0.139927 -0.111411 -0.123713 -0.123381 0.087935 0.082790 0.100798 0.087958 0.092336 0.072931 0.099535 0.096219 0.098944 0.121286 0.121600 0.108814 0.129458 0.133364 0.125405 0.138190 0.128227 0.130184 0.128471
qa: -0.0392 -0.0443 -0.2629 -0.3571 -0.2978 -0.0005 0.0696 0.0417 -0.0751 -0.2461 -0.2419 -0.2053 0.3088 0.0490 0.3302 0.0457 -0.2621 -0.2396 -0.1307 0.2156 -0.1158 -0.1482 0.1949 -0.1750 -0.1399 -0.1114 -0.1237 -0.1234 0.0879 0.0828 0.1008 0.0880 0.0923 0.0729 0.0995 0.0962 0.0989 0.1213 0.1216 0.1088 0.1295 0.1334 0.1254 0.1382 0.1282 0.1302 0.1285
va: 1.2879 1.2610 2.1276 2.1483 2.0956 3.1204 3.7773 3.8333 3.8433 3.9137 3.9038 3.9169 4.2997 4.2484 3.8218 3.6415 4.0296 4.0572 4.0110 3.8594 3.9801 3.9277 3.8485 4.0239 3.9664 3.9424 3.9444 3.9440 1.0498 1.0347 1.0186 1.0017 1.0028 1.0099 1.0031 1.0041 1.0286 1.0170 1.0327 1.0154 1.0012 1.0062 1.0115 1.0018 0.9992 0.9995 0.9996
dispcorr: -0.023871266 hartree
energy: -2050.684643482565
dipole: -0.18737 1.05296 0.86560 42.46970 -41.36053 1.10918 6.81306 -5.69153 1.12153
magnitude: 1.79927 au
magnitude: 4.57338 debye
