program: Orca
programVersion: 5.0.2
elementType: Cl Cl O O O N C C C C C C C C C C C C C C C C C C C C C C H H H H H H H H H H H H H H H H H H H
charge: 0
multiplicity: 1
keywords: wb97x-d3
keywords: def2-TZVPP
keywords: def2/J RIJCOSX
keywords: DEFGRID2
keywords: scfconv7
keywords: smallprint printgap noloewdin
keywords: NOSOSCF
formula: C22H19Cl2NO3
InChI: InChI=1/C22H19Cl2NO3/c1-22(2)17(12-19(23)24)20(22)21(26)28-18(13-25)14-7-6-10-16(11-14)27-15-8-4-3-5-9-15/h3-12,17-18,20H,1-2H3
47 atoms
Cl 0.866548 -6.217812 -1.238531
Cl 3.6344 -5.813415 -1.944689
O  -0.301068 0.003859 -0.896129
O  -1.494881 -1.787642 -0.281428
O  -1.443007 4.215098 2.208542
N  -0.87353 2.422541 -3.077645
C  1.162996 -2.518215 1.225758
C  1.040827 -3.318388 -0.037103
C  0.890927 -1.810333 -0.086641
C  0.075896 -2.670007 2.26165
C  2.525615 -2.279012 1.832469
C  2.199606 -3.944821 -0.684671
C  -0.433191 -1.242985 -0.411031
C  2.220434 -5.160832 -1.216839
C  -1.503382 0.693301 -1.222848
C  -2.096432 1.379954 -0.016984
C  -1.136725 1.656668 -2.263433
C  -1.466239 2.498821 0.513962
C  -3.244393 0.87142 0.570746
C  -2.009836 3.127755 1.624595
C  -3.770045 1.500299 1.690107
C  -3.164647 2.627284 2.215873
C  -0.7139 5.095568 1.454863
C  0.514603 5.501589 1.951597
C  -1.200515 5.610726 0.259947
C  1.259866 6.435568 1.247082
C  -0.43919 6.532074 -0.440627
C  0.790495 6.94973 0.048127
H  0.106292 -3.858726 -0.135435
H  1.726482 -1.248014 -0.487803
H  0.349163 -3.464108 2.958171
H  -0.88982 -2.923152 1.832407
H  -0.041965 -1.750471 2.83779
H  3.297545 -2.073726 1.091796
H  2.8447 -3.147194 2.410913
H  2.491231 -1.422655 2.507151
H  3.122138 -3.380467 -0.740582
H  -2.236323 0.002164 -1.650523
H  -0.566112 2.887101 0.052448
H  -3.720011 -0.010988 0.164941
H  -4.667195 1.112633 2.15363
H  -3.578495 3.128521 3.081004
H  0.876374 5.090892 2.885098
H  -2.161676 5.295048 -0.12495
H  2.217274 6.754751 1.637104
H  -0.814647 6.926807 -1.375124
H  1.377842 7.671266 -0.503004
totalener: -2050.66224038 hartree
nucrepener: 2690.76456838 hartree
electener: -4741.42680875 hartree
oneelecener: -8156.91584314 hartree
twoeener: 3415.48903438 hartree
kineticenergy: 2044.53776634 hartree
xcener: -151.872154511734 hartree
chargesum: 0.0000000
charge: -0.039070 -0.043888 -0.262133 -0.381760 -0.297213 -0.003138 0.066872 0.042424 -0.095954 -0.246654 -0.245741 -0.203446 0.362457 0.052236 0.333144 0.000619 -0.268576 -0.179168 -0.133594 0.215776 -0.092931 -0.200176 0.241817 -0.207673 -0.165907 -0.092032 -0.098786 -0.141616 0.086994 0.083035 0.090080 0.101022 0.090145 0.073513 0.100284 0.095367 0.097749 0.122569 0.128723 0.119351 0.128526 0.129329 0.124374 0.132507 0.125170 0.128710 0.126664
qa: -0.0391 -0.0439 -0.2621 -0.3818 -0.2972 -0.0031 0.0669 0.0424 -0.0960 -0.2467 -0.2457 -0.2034 0.3625 0.0522 0.3331 0.0006 -0.2686 -0.1792 -0.1336 0.2158 -0.0929 -0.2002 0.2418 -0.2077 -0.1659 -0.0920 -0.0988 -0.1416 0.0870 0.0830 0.0901 0.1010 0.0901 0.0735 0.1003 0.0954 0.0977 0.1226 0.1287 0.1194 0.1285 0.1293 0.1244 0.1325 0.1252 0.1287 0.1267
va: 1.2881 1.2613 2.1369 2.1230 2.1157 3.1158 3.7600 3.8259 3.8763 3.9153 3.9099 3.9230 4.2310 4.2516 3.8283 3.6645 4.0288 3.9718 3.9850 3.8602 3.9555 4.0335 3.7987 4.0448 3.9590 3.9312 3.9486 3.9621 1.0504 1.0350 1.0014 1.0208 1.0016 1.0101 1.0025 1.0042 1.0305 1.0175 1.0161 1.0209 0.9996 1.0116 1.0135 1.0032 0.9991 1.0000 1.0003
dispcorr: -0.023283079 hartree
energy: -2050.685523456904
dipole: -6.09600 6.26880 0.17280 31.08851 -30.93224 0.15627 21.51228 -20.16282 1.34946
magnitude: 1.36942 au
magnitude: 3.48079 debye
