program: Orca
programVersion: 5.0.2
elementType: Cl Cl O O O N C C C C C C C C C C C C C C C C C C C C C C H H H H H H H H H H H H H H H H H H H
charge: 0
multiplicity: 1
keywords: wb97x-d3
keywords: def2-TZVPP
keywords: def2/J RIJCOSX
keywords: DEFGRID2
keywords: scfconv7
keywords: smallprint printgap noloewdin
keywords: NOSOSCF
formula: C22H19Cl2NO3
InChI: InChI=1/C22H19Cl2NO3/c1-22(2)17(12-19(23)24)20(22)21(26)28-18(13-25)14-7-6-10-16(11-14)27-15-8-4-3-5-9-15/h3-12,17-18,20H,1-2H3
47 atoms
Cl 4.159561 -4.325973 -1.669507
Cl 3.248693 -6.764451 -0.42886
O  -0.527913 -0.892741 0.960762
O  0.994014 -0.409013 -0.602128
O  -1.717745 4.853147 -0.484423
N  -1.543183 0.512461 3.769854
C  -0.135975 -3.075405 -1.84868
C  1.204431 -3.324587 -1.221011
C  0.11779 -2.635882 -0.417491
C  -0.219888 -2.056061 -2.95803
C  -1.105443 -4.218473 -2.02715
C  1.627142 -4.667331 -0.803817
C  0.274814 -1.213466 -0.070583
C  2.845266 -5.172867 -0.950419
C  -0.546304 0.466172 1.355201
C  -1.403113 1.329746 0.452549
C  -1.107266 0.470233 2.708301
C  -1.134606 2.689783 0.399459
C  -2.460162 0.786501 -0.266042
C  -1.948052 3.514395 -0.366721
C  -3.241327 1.620066 -1.052739
C  -3.000164 2.983852 -1.099571
C  -1.375017 5.598765 0.611659
C  -0.509419 6.662491 0.396084
C  -1.902555 5.359437 1.875297
C  -0.167383 7.490662 1.454987
C  -1.540789 6.189563 2.926918
C  -0.674472 7.255418 2.725783
H  1.994184 -2.668471 -1.568849
H  -0.378417 -3.232531 0.339568
H  -0.14842 -2.562839 -3.921967
H  0.573334 -1.312914 -2.923874
H  -1.177598 -1.532297 -2.932211
H  -2.115883 -3.834403 -2.177075
H  -1.137976 -4.892397 -1.172038
H  -0.841613 -4.806796 -2.908009
H  0.890139 -5.305077 -0.330276
H  0.467299 0.876719 1.417801
H  -0.296518 3.098708 0.952295
H  -2.682238 -0.271501 -0.223604
H  -4.061156 1.204899 -1.623886
H  -3.620149 3.634807 -1.702942
H  -0.111582 6.84128 -0.595248
H  -2.59076 4.541529 2.048098
H  0.506549 8.319965 1.282453
H  -1.949119 6.000338 3.911479
H  -0.399596 7.898132 3.551703
elementType: Cl O N C H
totalener: -2050.68639976 hartree
nucrepener: 2663.06137659 hartree
electener: -4713.74777636 hartree
oneelecener: -8101.30381480 hartree
twoeener: 3387.55603844 hartree
cpcmener: -0.03197146 hartree
kineticenergy: 2044.46312992 hartree
xcener: -151.862782189296 hartree
chargesum: -0.0000000
charge: -0.054508 -0.059050 -0.285998 -0.434514 -0.327174 -0.086151 0.090289 0.031516 -0.068140 -0.263434 -0.264977 -0.204869 0.366988 0.040680 0.400505 0.047825 -0.229074 -0.210653 -0.212121 0.259403 -0.130961 -0.214699 0.292606 -0.255433 -0.194252 -0.117324 -0.144933 -0.188549 0.081627 0.098931 0.100313 0.096674 0.096446 0.098340 0.091228 0.102474 0.130045 0.144583 0.145627 0.147758 0.158488 0.148419 0.146246 0.154504 0.157387 0.159813 0.158097
qa: -0.0545 -0.0591 -0.2860 -0.4345 -0.3272 -0.0862 0.0903 0.0315 -0.0681 -0.2634 -0.2650 -0.2049 0.3670 0.0407 0.4005 0.0478 -0.2291 -0.2107 -0.2121 0.2594 -0.1310 -0.2147 0.2926 -0.2554 -0.1943 -0.1173 -0.1449 -0.1885 0.0816 0.0989 0.1003 0.0967 0.0964 0.0983 0.0912 0.1025 0.1300 0.1446 0.1456 0.1478 0.1585 0.1484 0.1462 0.1545 0.1574 0.1598 0.1581
va: 1.2712 1.2456 2.1135 2.0755 2.0822 3.1142 3.7325 3.8871 3.8308 3.9026 3.9081 3.8970 4.2058 4.2137 3.7225 3.6184 4.0664 3.9971 3.9448 3.7418 3.9181 4.0075 3.6887 4.0055 3.9019 3.8838 3.8938 3.9090 1.0476 1.0330 1.0011 1.0174 1.0010 1.0016 1.0056 1.0006 1.0183 1.0200 1.0049 1.0117 0.9902 1.0044 1.0083 0.9988 0.9891 0.9901 0.9904
dispcorr: -0.023430314 hartree
energy: -2050.709830077101
dipole: -26.24135 25.24258 -0.99877 26.34883 -26.61009 -0.26126 -4.83374 3.69696 -1.13679
magnitude: 1.53561 au
magnitude: 3.90320 debye
