program: Orca
programVersion: 5.0.2
elementType: Cl Cl O O O N C C C C C C C C C C C C C C C C C C C C C C H H H H H H H H H H H H H H H H H H H
charge: 0
multiplicity: 1
keywords: wb97x-d3
keywords: def2-TZVPP
keywords: def2/J RIJCOSX
keywords: DEFGRID2
keywords: scfconv7
keywords: smallprint printgap noloewdin
keywords: NOSOSCF
formula: C22H19Cl2NO3
InChI: InChI=1/C22H19Cl2NO3/c1-22(2)17(12-19(23)24)20(22)21(26)28-18(13-25)14-7-6-10-16(11-14)27-15-8-4-3-5-9-15/h3-12,17-18,20H,1-2H3
47 atoms
Cl 3.355504 -0.37966 -0.147198
Cl 4.511237 -1.711664 2.13589
O  -1.548555 -1.408009 -0.557181
O  -2.542557 -2.471159 1.136191
O  -0.9672 3.743922 0.529492
N  -2.719402 -0.082219 -3.346301
C  0.461908 -3.750233 -0.424766
C  1.039981 -2.483685 0.138984
C  -0.291667 -2.997268 0.654316
C  -0.000568 -3.731488 -1.86135
C  1.026289 -5.087876 -0.010158
C  2.185932 -2.489205 1.056885
C  -1.567777 -2.286443 0.452596
C  3.204491 -1.639736 1.016467
C  -2.737922 -0.659447 -0.798387
C  -2.774176 0.586405 0.05155
C  -2.711698 -0.341988 -2.227784
C  -1.826706 1.586818 -0.156868
C  -3.71691 0.69802 1.060277
C  -1.837374 2.708677 0.658185
C  -3.712253 1.827525 1.870158
C  -2.780432 2.829145 1.677543
C  -0.009591 3.713105 -0.457688
C  1.204515 3.087485 -0.218952
C  -0.26201 4.357245 -1.658671
C  2.183896 3.119585 -1.201934
C  0.725921 4.382617 -2.633502
C  1.94778 3.763749 -2.408826
H  0.981714 -1.630601 -0.526138
H  -0.266668 -3.475924 1.627078
H  0.801324 -4.102664 -2.502207
H  -0.264898 -2.740053 -2.221874
H  -0.862098 -4.386734 -2.002947
H  1.932253 -5.31381 -0.575609
H  0.302829 -5.879077 -0.214098
H  1.271669 -5.140479 1.049875
H  2.206794 -3.239993 1.838072
H  -3.629918 -1.266081 -0.617693
H  -1.096265 1.486955 -0.95118
H  -4.448095 -0.083968 1.217661
H  -4.442778 1.926076 2.662175
H  -2.778825 3.709598 2.307969
H  1.384413 2.58914 0.725613
H  -1.216077 4.841619 -1.825317
H  3.140646 2.648229 -1.019385
H  0.537044 4.887838 -3.571774
H  2.716767 3.787518 -3.169941
elementType: Cl O N C H
totalener: -2050.68460959 hartree
nucrepener: 2844.02247702 hartree
electener: -4894.70708660 hartree
oneelecener: -8463.45279765 hartree
twoeener: 3568.74571104 hartree
cpcmener: -0.03057722 hartree
kineticenergy: 2044.46849967 hartree
xcener: -151.862378430578 hartree
chargesum: -0.0000000
charge: -0.063105 -0.059193 -0.274292 -0.442110 -0.323801 -0.086335 0.088673 0.059104 -0.106148 -0.263792 -0.267307 -0.223345 0.422438 0.054848 0.381761 -0.007553 -0.235307 -0.204044 -0.198763 0.283380 -0.106038 -0.235163 0.218456 -0.165288 -0.171490 -0.148581 -0.154922 -0.156441 0.085585 0.095957 0.097006 0.091112 0.102594 0.100878 0.099407 0.090492 0.131083 0.138830 0.134767 0.142961 0.157495 0.145919 0.146362 0.149867 0.156040 0.158681 0.159324
qa: -0.0631 -0.0592 -0.2743 -0.4421 -0.3238 -0.0863 0.0887 0.0591 -0.1061 -0.2638 -0.2673 -0.2233 0.4224 0.0548 0.3818 -0.0076 -0.2353 -0.2040 -0.1988 0.2834 -0.1060 -0.2352 0.2185 -0.1653 -0.1715 -0.1486 -0.1549 -0.1564 0.0856 0.0960 0.0970 0.0911 0.1026 0.1009 0.0994 0.0905 0.1311 0.1388 0.1348 0.1430 0.1575 0.1459 0.1464 0.1499 0.1560 0.1587 0.1593
va: 1.2727 1.2465 2.1342 2.0701 2.0906 3.1053 3.7314 3.8264 3.8774 3.9139 3.9138 3.8935 4.1724 4.2049 3.7717 3.6773 4.0620 3.9532 3.9553 3.7656 3.9054 4.0066 3.7649 3.9442 3.9730 3.8798 3.9042 3.9158 1.0368 1.0303 1.0004 1.0107 0.9998 1.0009 1.0009 1.0059 1.0183 1.0179 1.0203 1.0102 0.9893 1.0076 1.0082 1.0014 0.9942 0.9899 0.9907
dispcorr: -0.025558787 hartree
energy: -2050.710168373452
dipole: -15.35331 15.67704 0.32373 -7.78158 6.81536 -0.96623 -8.80806 9.39960 0.59154
magnitude: 1.17827 au
magnitude: 2.99492 debye
