program: Orca
programVersion: 5.0.2
elementType: Cl Cl O O O N C C C C C C C C C C C C C C C C C C C C C C H H H H H H H H H H H H H H H H H H H
charge: 0
multiplicity: 1
keywords: wb97x-d3
keywords: def2-TZVPP
keywords: def2/J RIJCOSX
keywords: DEFGRID2
keywords: scfconv7
keywords: smallprint printgap noloewdin
keywords: NOSOSCF
formula: C22H19Cl2NO3
InChI: InChI=1/C22H19Cl2NO3/c1-22(2)17(12-19(23)24)20(22)21(26)28-18(13-25)14-7-6-10-16(11-14)27-15-8-4-3-5-9-15/h3-12,17-18,20H,1-2H3
47 atoms
Cl 3.800883 -4.694662 -2.192229
Cl 3.251487 -6.793533 -0.291713
O  -0.15336 -0.686336 0.868443
O  0.911073 -0.483176 -1.088349
O  -2.179912 4.926181 -0.283819
N  -0.176549 1.082953 3.652541
C  -0.398946 -3.311943 -1.561576
C  1.052138 -3.485991 -1.219267
C  0.16786 -2.635926 -0.326888
C  -0.735562 -2.503836 -2.790627
C  -1.376202 -4.434214 -1.308736
C  1.574556 -4.74262 -0.667921
C  0.372647 -1.179342 -0.269041
C  2.7182 -5.321395 -1.010915
C  -0.090458 0.711104 1.066332
C  -1.241606 1.456624 0.419305
C  -0.140057 0.900051 2.519148
C  -1.15168 2.840982 0.349589
C  -2.367694 0.795841 -0.048885
C  -2.212799 3.568656 -0.169436
C  -3.40489 1.53762 -0.598941
C  -3.341986 2.919589 -0.652565
C  -1.601391 5.694201 0.691701
C  -0.89784 6.814851 0.273732
C  -1.756808 5.41817 2.045168
C  -0.346985 7.667169 1.220066
C  -1.1893 6.273039 2.979142
C  -0.483292 7.398254 2.57481
H  1.733517 -2.927787 -1.851509
H  -0.132259 -3.082532 0.614238
H  -0.866807 -3.176024 -3.640444
H  0.035973 -1.786806 -3.061392
H  -1.672297 -1.95953 -2.653868
H  -2.394313 -4.04283 -1.269488
H  -1.195802 -4.960359 -0.372007
H  -1.333896 -5.16567 -2.117937
H  0.986629 -5.243425 0.09201
H  0.863487 1.120865 0.716474
H  -0.259153 3.343214 0.705559
H  -2.454807 -0.280747 0.006773
H  -4.283615 1.030508 -0.975112
H  -4.160409 3.495007 -1.066471
H  -0.789823 7.020331 -0.784028
H  -2.315435 4.551879 2.377207
H  0.197924 8.542756 0.891306
H  -1.307993 6.056311 4.033042
H  -0.046059 8.060987 3.309918
elementType: Cl O N C H
totalener: -2050.68603472 hartree
nucrepener: 2653.87606015 hartree
electener: -4704.56209487 hartree
oneelecener: -8082.87857459 hartree
twoeener: 3378.31647972 hartree
cpcmener: -0.03184491 hartree
kineticenergy: 2044.45522357 hartree
xcener: -151.861760865314 hartree
chargesum: 0.0000000
charge: -0.053885 -0.059145 -0.287066 -0.434582 -0.326684 -0.087418 0.095182 0.027870 -0.074514 -0.263116 -0.262817 -0.201452 0.370848 0.037859 0.392564 0.070471 -0.224303 -0.237702 -0.213632 0.269975 -0.126166 -0.227304 0.288909 -0.251458 -0.194094 -0.118486 -0.140263 -0.188843 0.082257 0.097673 0.100220 0.096836 0.096738 0.098276 0.090752 0.102146 0.130664 0.143484 0.147657 0.149489 0.157976 0.148548 0.145897 0.154700 0.158119 0.159440 0.158382
qa: -0.0539 -0.0591 -0.2871 -0.4346 -0.3267 -0.0874 0.0952 0.0279 -0.0745 -0.2631 -0.2628 -0.2015 0.3708 0.0379 0.3926 0.0705 -0.2243 -0.2377 -0.2136 0.2700 -0.1262 -0.2273 0.2889 -0.2515 -0.1941 -0.1185 -0.1403 -0.1888 0.0823 0.0977 0.1002 0.0968 0.0967 0.0983 0.0908 0.1021 0.1307 0.1435 0.1477 0.1495 0.1580 0.1485 0.1459 0.1547 0.1581 0.1594 0.1584
va: 1.2719 1.2456 2.1104 2.0754 2.0842 3.1135 3.7287 3.8976 3.8405 3.9012 3.9070 3.8926 4.1900 4.2139 3.7328 3.6219 4.0507 3.9932 3.9532 3.7400 3.9207 4.0114 3.6871 4.0103 3.9063 3.8826 3.8907 3.9091 1.0461 1.0344 1.0013 1.0177 1.0011 1.0017 1.0057 1.0011 1.0179 1.0225 1.0049 1.0086 0.9906 1.0048 1.0083 0.9985 0.9889 0.9901 0.9904
dispcorr: -0.023359361 hartree
energy: -2050.709394079294
dipole: -27.78745 26.44129 -1.34615 25.58550 -25.99750 -0.41201 -1.10114 0.28185 -0.81929
magnitude: 1.62884 au
magnitude: 4.14018 debye
