program: Orca
programVersion: 5.0.2
elementType: Cl Cl O O O N C C C C C C C C C C C C C C C C C C C C C C H H H H H H H H H H H H H H H H H H H
charge: 0
multiplicity: 1
keywords: wb97x-d3
keywords: def2-TZVPP
keywords: def2/J RIJCOSX
keywords: DEFGRID2
keywords: scfconv7
keywords: smallprint printgap noloewdin
keywords: NOSOSCF
formula: C22H19Cl2NO3
InChI: InChI=1/C22H19Cl2NO3/c1-22(2)17(12-19(23)24)20(22)21(26)28-18(13-25)14-7-6-10-16(11-14)27-15-8-4-3-5-9-15/h3-12,17-18,20H,1-2H3
47 atoms
Cl 3.041307 -0.97479 -1.941689
Cl 4.777943 -0.48911 0.30978
O  -1.705999 -1.48846 -0.220428
O  -2.245166 -1.782435 1.924001
O  -1.098266 3.475929 0.660384
N  -3.266488 -0.895296 -3.058744
C  0.577278 -3.491522 0.5737
C  1.040914 -2.11375 0.186322
C  -0.030821 -2.274151 1.241524
C  -0.208623 -4.2831 -0.441758
C  1.455033 -4.353605 1.447122
C  2.355516 -1.595004 0.590404
C  -1.426419 -1.837488 1.043616
C  3.26109 -1.092541 -0.239541
C  -2.988005 -0.932865 -0.461318
C  -3.117135 0.472923 0.085275
C  -3.127229 -0.91982 -1.919243
C  -2.005872 1.309006 0.088347
C  -4.343313 0.911703 0.555995
C  -2.133161 2.598093 0.586059
C  -4.456362 2.209816 1.038128
C  -3.361091 3.05376 1.059279
C  0.112339 3.141172 0.098407
C  1.149783 2.748391 0.928704
C  0.288555 3.237767 -1.274418
C  2.388501 2.456004 0.372392
C  1.528539 2.936417 -1.81889
C  2.579799 2.544817 -0.999414
H  0.695805 -1.783559 -0.786263
H  0.279473 -2.13201 2.271241
H  0.470731 -4.905834 -1.026453
H  -0.759968 -3.660942 -1.144248
H  -0.920045 -4.947648 0.052463
H  2.221864 -4.847338 0.847263
H  0.86012 -5.131095 1.929695
H  1.957157 -3.791209 2.233662
H  2.612992 -1.619056 1.642903
H  -3.782921 -1.5692 -0.058181
H  -1.053932 0.952585 -0.284117
H  -5.200733 0.250722 0.552726
H  -5.408427 2.565511 1.409392
H  -3.448046 4.061861 1.444848
H  0.993927 2.680196 1.998214
H  -0.532742 3.547207 -1.909353
H  3.205002 2.157426 1.016753
H  1.671919 3.010381 -2.889251
H  3.545628 2.314907 -1.429179
elementType: Cl O N C H
totalener: -2050.68429708 hartree
nucrepener: 2923.94247363 hartree
electener: -4974.62677071 hartree
oneelecener: -8623.23824263 hartree
twoeener: 3648.61147192 hartree
cpcmener: -0.03191731 hartree
kineticenergy: 2044.47127939 hartree
xcener: -151.865439931285 hartree
chargesum: 0.0000000
charge: -0.057299 -0.061445 -0.279419 -0.427122 -0.324624 -0.084934 0.094913 0.060920 -0.102872 -0.266883 -0.265330 -0.229116 0.392082 0.050691 0.365203 0.007201 -0.228689 -0.192711 -0.232174 0.295057 -0.095115 -0.245898 0.241735 -0.188179 -0.172968 -0.148341 -0.146916 -0.157921 0.088209 0.100790 0.097354 0.094482 0.102550 0.101606 0.099836 0.089768 0.134741 0.147319 0.134134 0.143155 0.157245 0.146249 0.147748 0.152629 0.152173 0.158384 0.151784
qa: -0.0573 -0.0614 -0.2794 -0.4271 -0.3246 -0.0849 0.0949 0.0609 -0.1029 -0.2669 -0.2653 -0.2291 0.3921 0.0507 0.3652 0.0072 -0.2287 -0.1927 -0.2322 0.2951 -0.0951 -0.2459 0.2417 -0.1882 -0.1730 -0.1483 -0.1469 -0.1579 0.0882 0.1008 0.0974 0.0945 0.1025 0.1016 0.0998 0.0898 0.1347 0.1473 0.1341 0.1432 0.1572 0.1462 0.1477 0.1526 0.1522 0.1584 0.1518
va: 1.2645 1.2427 2.1110 2.0835 2.0950 3.1099 3.7484 3.7848 3.8912 3.9137 3.9099 3.8712 4.1667 4.1899 3.7622 3.6816 4.0656 3.9226 4.0056 3.7381 3.8924 4.0032 3.7193 3.9972 3.9504 3.8231 3.9085 3.8182 1.0383 1.0296 1.0010 1.0112 0.9996 1.0010 1.0019 1.0045 1.0144 1.0154 1.0249 1.0029 0.9889 1.0078 1.0034 0.9991 0.9998 0.9903 1.0046
dispcorr: -0.028506384 hartree
energy: -2050.712803465675
dipole: -13.83776 14.35585 0.51809 -9.45695 8.61160 -0.84536 8.59482 -7.36035 1.23448
magnitude: 1.58335 au
magnitude: 4.02455 debye
