program: Orca
programVersion: 5.0.2
elementType: Cl Cl O O O N C C C C C C C C C C C C C C C C C C C C C C H H H H H H H H H H H H H H H H H H H
charge: 0
multiplicity: 1
keywords: wb97x-d3
keywords: def2-TZVPP
keywords: def2/J RIJCOSX
keywords: DEFGRID2
keywords: scfconv7
keywords: smallprint printgap noloewdin
keywords: NOSOSCF
formula: C22H19Cl2NO3
InChI: InChI=1/C22H19Cl2NO3/c1-22(2)17(12-19(23)24)20(22)21(26)28-18(13-25)14-7-6-10-16(11-14)27-15-8-4-3-5-9-15/h3-12,17-18,20H,1-2H3
47 atoms
Cl 3.710992 -4.61471 -2.37738
Cl 3.363308 -6.712938 -0.427731
O  -0.123546 -0.682228 0.915022
O  0.757636 -0.478715 -1.12982
O  -2.209675 4.886634 -0.314578
N  -0.023147 1.143145 3.666251
C  -0.461151 -3.359348 -1.472643
C  1.012432 -3.473623 -1.212052
C  0.147706 -2.641138 -0.282956
C  -0.898258 -2.590555 -2.695157
C  -1.375022 -4.515613 -1.145355
C  1.611852 -4.705527 -0.683997
C  0.310256 -1.178027 -0.259623
C  2.737514 -5.261435 -1.113811
C  -0.066658 0.719598 1.087295
C  -1.25614 1.445435 0.48987
C  -0.042866 0.933828 2.537351
C  -1.160921 2.822784 0.3417
C  -2.421621 0.775932 0.145288
C  -2.252632 3.53609 -0.132586
C  -3.491685 1.501336 -0.361472
C  -3.421442 2.878518 -0.492136
C  -1.590108 5.680466 0.614899
C  -0.842183 6.747957 0.140045
C  -1.745135 5.472322 1.980551
C  -0.245572 7.616439 1.043528
C  -1.132884 6.341914 2.871236
C  -0.38135 7.414788 2.410027
H  1.634287 -2.899803 -1.890165
H  -0.081493 -3.08137 0.680822
H  -1.057401 -3.286951 -3.520478
H  -0.168459 -1.856486 -3.028431
H  -1.843022 -2.073606 -2.514554
H  -1.339159 -5.264708 -1.938531
H  -2.406495 -4.167728 -1.065697
H  -1.126639 -5.009277 -0.206583
H  1.098783 -5.211277 0.125205
H  0.863603 1.133134 0.682303
H  -0.240009 3.332699 0.602242
H  -2.512404 -0.295444 0.264018
H  -4.401541 0.986848 -0.641407
H  -4.264447 3.442349 -0.871181
H  -0.732559 6.898982 -0.926799
H  -2.338589 4.646482 2.353269
H  0.336291 8.450457 0.672511
H  -1.252977 6.179572 3.934851
H  0.090875 8.09046 3.111005
elementType: Cl O N C H
totalener: -2050.68607415 hartree
nucrepener: 2655.35309824 hartree
electener: -4706.03917239 hartree
oneelecener: -8085.89689388 hartree
twoeener: 3379.85772149 hartree
cpcmener: -0.03196567 hartree
kineticenergy: 2044.45191984 hartree
xcener: -151.860654614061 hartree
chargesum: -0.0000000
charge: -0.054296 -0.058840 -0.288248 -0.435384 -0.328778 -0.086244 0.096079 0.027877 -0.076159 -0.264319 -0.263734 -0.201687 0.374035 0.039097 0.394730 0.059279 -0.225684 -0.214891 -0.207159 0.248334 -0.131647 -0.217734 0.270484 -0.242312 -0.180282 -0.122714 -0.144797 -0.184552 0.082745 0.098129 0.099712 0.096184 0.097680 0.102139 0.098558 0.091448 0.130193 0.143539 0.147068 0.148167 0.158190 0.148725 0.146187 0.155089 0.158033 0.159309 0.158453
qa: -0.0543 -0.0588 -0.2882 -0.4354 -0.3288 -0.0862 0.0961 0.0279 -0.0762 -0.2643 -0.2637 -0.2017 0.3740 0.0391 0.3947 0.0593 -0.2257 -0.2149 -0.2072 0.2483 -0.1316 -0.2177 0.2705 -0.2423 -0.1803 -0.1227 -0.1448 -0.1846 0.0827 0.0981 0.0997 0.0962 0.0977 0.1021 0.0986 0.0914 0.1302 0.1435 0.1471 0.1482 0.1582 0.1487 0.1462 0.1551 0.1580 0.1593 0.1585
va: 1.2714 1.2458 2.1123 2.0744 2.0777 3.1144 3.7219 3.8945 3.8480 3.9013 3.9075 3.8950 4.1833 4.2120 3.7331 3.6247 4.0552 3.9809 3.9499 3.7533 3.9229 4.0070 3.7007 4.0066 3.8984 3.8864 3.8954 3.9042 1.0458 1.0340 1.0009 1.0180 1.0005 1.0009 1.0016 1.0053 1.0178 1.0216 1.0049 1.0100 0.9904 1.0044 1.0076 0.9982 0.9890 0.9902 0.9902
dispcorr: -0.023344854 hartree
energy: -2050.709419003267
dipole: -28.09775 26.75164 -1.34612 24.72094 -25.19948 -0.47855 0.40597 -1.09453 -0.68856
magnitude: 1.58592 au
magnitude: 4.03109 debye
