program: Orca
programVersion: 5.0.2
elementType: Cl Cl O O O N C C C C C C C C C C C C C C C C C C C C C C H H H H H H H H H H H H H H H H H H H
charge: 0
multiplicity: 1
keywords: wb97x-d3
keywords: def2-TZVPP
keywords: def2/J RIJCOSX
keywords: DEFGRID2
keywords: scfconv7
keywords: smallprint printgap noloewdin
keywords: NOSOSCF
formula: C22H19Cl2NO3
InChI: InChI=1/C22H19Cl2NO3/c1-22(2)17(12-19(23)24)20(22)21(26)28-18(13-25)14-7-6-10-16(11-14)27-15-8-4-3-5-9-15/h3-12,17-18,20H,1-2H3
47 atoms
Cl 3.849718 -4.785006 -1.836524
Cl 3.105971 -6.808058 0.080022
O  -0.128701 -0.618627 0.737502
O  0.898772 -0.522647 -1.250521
O  -2.366427 4.926933 -0.302124
N  0.230879 1.229874 3.448328
C  -0.418808 -3.357195 -1.592761
C  1.013819 -3.543102 -1.186269
C  0.116099 -2.619376 -0.380863
C  -0.687663 -2.627042 -2.885451
C  -1.438187 -4.432662 -1.304523
C  1.483621 -4.77316 -0.537419
C  0.358733 -1.16805 -0.391973
C  2.653078 -5.364558 -0.744441
C  -0.050646 0.783261 0.88798
C  -1.294732 1.49555 0.394403
C  0.105366 1.01518 2.326998
C  -1.228888 2.874625 0.244592
C  -2.476718 0.81179 0.150867
C  -2.368007 3.576262 -0.123989
C  -3.597643 1.52642 -0.251253
C  -3.556614 2.904363 -0.378955
C  -1.612212 5.727514 0.515894
C  -0.935066 6.782306 -0.078416
C  -1.567554 5.53876 1.892553
C  -0.204715 7.656286 0.71479
C  -0.823294 6.413187 2.670819
C  -0.140257 7.473508 2.089098
H  1.731131 -3.038821 -1.824021
H  -0.226777 -3.005253 0.572192
H  -0.792069 -3.353664 -3.693155
H  0.106068 -1.940257 -3.169343
H  -1.620715 -2.063207 -2.827375
H  -1.311948 -4.897131 -0.327319
H  -1.388453 -5.219183 -2.059597
H  -2.443562 -4.00892 -1.333175
H  0.826279 -5.243495 0.184317
H  0.836963 1.192067 0.393622
H  -0.293368 3.392929 0.423109
H  -2.54169 -0.26109 0.269352
H  -4.522992 1.00178 -0.449564
H  -4.438235 3.459245 -0.674076
H  -0.983515 6.919086 -1.151752
H  -2.10465 4.722357 2.359672
H  0.321536 8.480505 0.250512
H  -0.78491 6.264781 3.742577
H  0.435721 8.15309 2.70339
elementType: Cl O N C H
totalener: -2050.68573672 hartree
nucrepener: 2649.67644730 hartree
electener: -4700.36218402 hartree
oneelecener: -8074.47902694 hartree
twoeener: 3374.11684292 hartree
cpcmener: -0.03143221 hartree
kineticenergy: 2044.45902481 hartree
xcener: -151.862145661386 hartree
chargesum: 0.0000000
charge: -0.054120 -0.059281 -0.290125 -0.437485 -0.327411 -0.088079 0.100074 0.022394 -0.082477 -0.264483 -0.265377 -0.196051 0.386358 0.037459 0.392073 0.072404 -0.222310 -0.232444 -0.211980 0.263618 -0.130154 -0.223565 0.276002 -0.243967 -0.187501 -0.121696 -0.140959 -0.183173 0.083156 0.096064 0.098919 0.096249 0.098552 0.091325 0.101723 0.098149 0.128751 0.142096 0.146452 0.148382 0.157693 0.148646 0.146544 0.155053 0.157377 0.159677 0.157445
qa: -0.0541 -0.0593 -0.2901 -0.4375 -0.3274 -0.0881 0.1001 0.0224 -0.0825 -0.2645 -0.2654 -0.1961 0.3864 0.0375 0.3921 0.0724 -0.2223 -0.2324 -0.2120 0.2636 -0.1302 -0.2236 0.2760 -0.2440 -0.1875 -0.1217 -0.1410 -0.1832 0.0832 0.0961 0.0989 0.0962 0.0986 0.0913 0.1017 0.0981 0.1288 0.1421 0.1465 0.1484 0.1577 0.1486 0.1465 0.1551 0.1574 0.1597 0.1574
va: 1.2718 1.2454 2.1086 2.0771 2.0817 3.1127 3.7263 3.9075 3.8395 3.9027 3.9094 3.8927 4.1782 4.2162 3.7259 3.6386 4.0511 3.9865 3.9516 3.7473 3.9244 4.0060 3.6958 4.0095 3.9073 3.8840 3.8896 3.9055 1.0452 1.0349 1.0008 1.0186 1.0000 1.0057 1.0012 1.0016 1.0193 1.0266 1.0054 1.0106 0.9908 1.0049 1.0075 0.9981 0.9893 0.9900 0.9907
dispcorr: -0.023047717 hartree
energy: -2050.708784432383
dipole: -27.53895 26.00906 -1.52990 25.59671 -25.98705 -0.39034 -3.49898 2.62980 -0.86918
magnitude: 1.80234 au
magnitude: 4.58118 debye
