program: Orca
programVersion: 5.0.2
elementType: Cl Cl O O O N C C C C C C C C C C C C C C C C C C C C C C H H H H H H H H H H H H H H H H H H H
charge: 0
multiplicity: 1
keywords: wb97x-d3
keywords: def2-TZVPP
keywords: def2/J RIJCOSX
keywords: DEFGRID2
keywords: scfconv7
keywords: smallprint printgap noloewdin
keywords: NOSOSCF
formula: C22H19Cl2NO3
InChI: InChI=1/C22H19Cl2NO3/c1-22(2)17(12-19(23)24)20(22)21(26)28-18(13-25)14-7-6-10-16(11-14)27-15-8-4-3-5-9-15/h3-12,17-18,20H,1-2H3
47 atoms
Cl 0.479993 -1.435416 2.637975
Cl 1.970225 -3.454894 4.074685
O  -1.78678 -1.659925 -0.712601
O  0.060131 -0.638654 -1.437252
O  -0.852883 4.034741 0.144634
N  -2.515548 0.18542 -3.48586
C  1.35124 -3.495944 -1.111876
C  1.638447 -2.669693 0.091104
C  0.207522 -2.792147 -0.395149
C  1.834077 -3.013424 -2.456649
C  1.343012 -4.999616 -0.980748
C  1.996476 -3.261479 1.398572
C  -0.457707 -1.590617 -0.912441
C  1.542106 -2.78589 2.54964
C  -2.548885 -0.486659 -0.959725
C  -2.182633 0.627085 -0.003263
C  -2.486356 -0.104962 -2.375075
C  -1.691639 1.848733 -0.43708
C  -2.326855 0.368356 1.356162
C  -1.316743 2.8041 0.500282
C  -1.958653 1.33478 2.278058
C  -1.443452 2.551319 1.858249
C  -0.094196 4.203994 -0.982603
C  0.910449 3.314795 -1.34553
C  -0.330094 5.349969 -1.727927
C  1.672048 3.581569 -2.474205
C  0.448659 5.609761 -2.846454
C  1.447003 4.725182 -3.228786
H  2.096731 -1.703693 -0.107423
H  -0.436309 -3.446124 0.181507
H  1.155517 -3.32763 -3.251273
H  2.812072 -3.449931 -2.668192
H  1.942902 -1.932584 -2.512864
H  2.353604 -5.399214 -1.08673
H  0.727621 -5.44624 -1.763763
H  0.94848 -5.337017 -0.02144
H  2.674555 -4.107488 1.426556
H  -3.58104 -0.795955 -0.775517
H  -1.591301 2.058071 -1.494915
H  -2.721841 -0.580275 1.696954
H  -2.066683 1.138669 3.336695
H  -1.146206 3.303936 2.577467
H  1.103183 2.422056 -0.763354
H  -1.114525 6.034454 -1.430159
H  2.451335 2.886883 -2.75979
H  0.264959 6.505519 -3.425556
H  2.04778 4.9259 -4.106027
elementType: Cl O N C H
totalener: -2050.68232481 hartree
nucrepener: 2871.83149746 hartree
electener: -4922.51382226 hartree
oneelecener: -8520.16413547 hartree
twoeener: 3597.65031321 hartree
cpcmener: -0.03116998 hartree
kineticenergy: 2044.49063225 hartree
xcener: -151.869769091176 hartree
chargesum: -0.0000000
charge: -0.051806 -0.055200 -0.281699 -0.445173 -0.325475 -0.078613 0.133094 -0.037455 -0.115695 -0.271628 -0.279092 -0.229408 0.399054 0.088661 0.481013 0.015080 -0.255542 -0.187017 -0.322376 0.283070 -0.103238 -0.230832 0.293474 -0.195269 -0.253231 -0.137964 -0.118318 -0.186955 0.119573 0.110518 0.101577 0.096684 0.095386 0.102138 0.100261 0.093457 0.140474 0.144880 0.138139 0.147735 0.161662 0.147407 0.150622 0.144899 0.158638 0.157284 0.157202
qa: -0.0518 -0.0552 -0.2817 -0.4452 -0.3255 -0.0786 0.1331 -0.0375 -0.1157 -0.2716 -0.2791 -0.2294 0.3991 0.0887 0.4810 0.0151 -0.2555 -0.1870 -0.3224 0.2831 -0.1032 -0.2308 0.2935 -0.1953 -0.2532 -0.1380 -0.1183 -0.1870 0.1196 0.1105 0.1016 0.0967 0.0954 0.1021 0.1003 0.0935 0.1405 0.1449 0.1381 0.1477 0.1617 0.1474 0.1506 0.1449 0.1586 0.1573 0.1572
va: 1.2958 1.2515 2.1248 2.0548 2.0887 3.1057 3.7245 3.8759 3.8465 3.8918 3.9116 3.9166 4.1143 4.1815 3.8386 3.6282 4.0886 3.8901 3.9537 3.7812 3.8349 4.0152 3.6877 3.9071 4.0151 3.8898 3.8812 3.9104 1.0185 1.0252 0.9990 1.0013 1.0183 0.9994 1.0028 0.9994 1.0082 0.9909 1.0150 1.0127 0.9882 1.0052 1.0056 1.0085 0.9904 0.9891 0.9907
dispcorr: -0.026781309 hartree
energy: -2050.709106113712
dipole: 4.49308 -4.14828 0.34481 1.30099 -3.07844 -1.77745 -24.71760 25.85631 1.13871
magnitude: 2.13890 au
magnitude: 5.43664 debye
