program: Orca
programVersion: 5.0.2
elementType: Cl Cl O O O N C C C C C C C C C C C C C C C C C C C C C C H H H H H H H H H H H H H H H H H H H
charge: 0
multiplicity: 1
keywords: wb97x-d3
keywords: def2-TZVPP
keywords: def2/J RIJCOSX
keywords: DEFGRID2
keywords: scfconv7
keywords: smallprint printgap noloewdin
keywords: NOSOSCF
formula: C22H19Cl2NO3
InChI: InChI=1/C22H19Cl2NO3/c1-22(2)17(12-19(23)24)20(22)21(26)28-18(13-25)14-7-6-10-16(11-14)27-15-8-4-3-5-9-15/h3-12,17-18,20H,1-2H3
47 atoms
Cl 4.206051 -3.707659 0.486938
Cl 3.230189 -6.312153 -0.278708
O  -1.610646 -1.148715 0.243651
O  0.418197 -0.231441 0.457187
O  -1.344553 4.501139 -0.540524
N  -4.299956 -1.116181 2.138488
C  0.97064 -1.987101 -2.095054
C  1.577535 -2.634774 -0.884618
C  0.121209 -2.212279 -0.858116
C  1.451411 -0.604568 -2.460567
C  0.606284 -2.82107 -3.299573
C  1.88408 -4.069068 -0.839525
C  -0.289411 -1.095563 0.008195
C  2.960084 -4.610898 -0.283853
C  -2.176384 -0.091811 1.01383
C  -2.522473 1.09648 0.148704
C  -3.368327 -0.671858 1.635195
C  -1.767763 2.256786 0.2662
C  -3.549789 1.007946 -0.783524
C  -2.062854 3.345086 -0.546656
C  -3.827846 2.099854 -1.590332
C  -3.09505 3.269643 -1.473057
C  -0.680298 4.932528 0.576458
C  0.601524 5.430456 0.390362
C  -1.273528 4.950427 1.832667
C  1.294211 5.954378 1.47222
C  -0.563148 5.464761 2.908037
C  0.719156 5.968898 2.735249
H  2.244754 -1.992622 -0.320842
H  -0.612439 -3.005252 -0.949274
H  1.822417 -0.035277 -1.611578
H  0.655006 -0.027213 -2.933899
H  2.269633 -0.685903 -3.178321
H  1.486588 -3.004464 -3.918408
H  -0.125223 -2.2915 -3.912297
H  0.172078 -3.785801 -3.040249
H  1.174052 -4.753285 -1.288645
H  -1.505111 0.209967 1.823384
H  -0.958435 2.300177 0.98417
H  -4.136261 0.102433 -0.880624
H  -4.629595 2.045493 -2.314875
H  -3.316798 4.123567 -2.100862
H  1.047909 5.415229 -0.596205
H  -2.27905 4.575153 1.978095
H  2.291278 6.348559 1.323119
H  -1.023847 5.476881 3.887444
H  1.263552 6.373662 3.578218
elementType: Cl O N C H
totalener: -2050.68673687 hartree
nucrepener: 2696.36941552 hartree
electener: -4747.05615239 hartree
oneelecener: -8168.11335394 hartree
twoeener: 3421.05720156 hartree
cpcmener: -0.03010111 hartree
kineticenergy: 2044.46896069 hartree
xcener: -151.862924050374 hartree
chargesum: -0.0000000
charge: -0.054977 -0.059696 -0.275467 -0.446935 -0.323025 -0.088505 0.086431 0.035158 -0.090094 -0.268545 -0.264851 -0.203567 0.407536 0.040619 0.401930 -0.011543 -0.225328 -0.174823 -0.216888 0.293522 -0.123577 -0.236137 0.297311 -0.250603 -0.210805 -0.117726 -0.134576 -0.186622 0.080196 0.097419 0.096250 0.100420 0.099533 0.101418 0.099235 0.091507 0.130160 0.135033 0.140110 0.144577 0.159092 0.147357 0.145920 0.158139 0.158041 0.159345 0.158030
qa: -0.0550 -0.0597 -0.2755 -0.4469 -0.3230 -0.0885 0.0864 0.0352 -0.0901 -0.2685 -0.2649 -0.2036 0.4075 0.0406 0.4019 -0.0115 -0.2253 -0.1748 -0.2169 0.2935 -0.1236 -0.2361 0.2973 -0.2506 -0.2108 -0.1177 -0.1346 -0.1866 0.0802 0.0974 0.0963 0.1004 0.0995 0.1014 0.0992 0.0915 0.1302 0.1350 0.1401 0.1446 0.1591 0.1474 0.1459 0.1581 0.1580 0.1593 0.1580
va: 1.2706 1.2451 2.1356 2.0663 2.0900 3.1111 3.7390 3.8665 3.8554 3.9060 3.9065 3.8984 4.1847 4.2144 3.7405 3.6522 4.0664 3.9135 3.9942 3.7407 3.9142 4.0175 3.6764 4.0183 3.9295 3.8804 3.8830 3.9104 1.0475 1.0332 1.0181 0.9992 1.0004 1.0009 1.0012 1.0058 1.0186 1.0182 1.0207 1.0082 0.9898 1.0065 1.0082 0.9964 0.9891 0.9899 0.9907
dispcorr: -0.023042894 hartree
energy: -2050.709779759487
dipole: -14.03915 14.28247 0.24333 29.92714 -29.17519 0.75195 -12.93204 11.43541 -1.49663
magnitude: 1.69250 au
magnitude: 4.30198 debye
