program: Orca
programVersion: 5.0.2
elementType: Cl Cl O O O N C C C C C C C C C C C C C C C C C C C C C C H H H H H H H H H H H H H H H H H H H
charge: 0
multiplicity: 1
keywords: wb97x-d3
keywords: def2-TZVPP
keywords: def2/J RIJCOSX
keywords: DEFGRID2
keywords: scfconv7
keywords: smallprint printgap noloewdin
keywords: NOSOSCF
formula: C22H19Cl2NO3
InChI: InChI=1/C22H19Cl2NO3/c1-22(2)17(12-19(23)24)20(22)21(26)28-18(13-25)14-7-6-10-16(11-14)27-15-8-4-3-5-9-15/h3-12,17-18,20H,1-2H3
47 atoms
Cl 0.793151 -3.639404 -2.285624
Cl 3.551718 -4.478021 -2.432039
O  -1.039682 -0.45141 -0.943955
O  -1.386389 -1.649299 0.910736
O  -1.512372 4.191385 1.059635
N  -2.880866 0.422431 -3.53145
C  1.716611 -1.360349 1.299392
C  1.473599 -2.62382 0.549831
C  0.838178 -1.341157 0.05646
C  1.123075 -1.210649 2.677618
C  3.042208 -0.656477 1.139756
C  2.524925 -3.262955 -0.272821
C  -0.623241 -1.193509 0.099585
C  2.317813 -3.728886 -1.496206
C  -2.423408 -0.16397 -1.026492
C  -2.830327 1.00805 -0.159756
C  -2.663302 0.158323 -2.435159
C  -1.933624 2.041394 0.073669
C  -4.123473 1.065875 0.34205
C  -2.342036 3.132257 0.829563
C  -4.521545 2.17389 1.075268
C  -3.634468 3.20825 1.328988
C  -0.203837 3.953825 1.392468
C  0.137276 3.035569 2.378144
C  0.77137 4.702501 0.751008
C  1.47211 2.874554 2.719615
C  2.10281 4.534622 1.106832
C  2.459529 3.619142 2.086938
H  0.784703 -3.31901 1.024492
H  1.301106 -0.891578 -0.814247
H  0.868913 -0.169326 2.883639
H  1.858519 -1.522478 3.421722
H  0.231276 -1.813408 2.830885
H  3.783169 -1.069526 1.826976
H  2.93689 0.406069 1.367146
H  3.442778 -0.736263 0.128534
H  3.516604 -3.374153 0.151513
H  -3.031763 -1.04116 -0.78212
H  -0.930553 2.00844 -0.33403
H  -4.816605 0.254572 0.158513
H  -5.528556 2.226801 1.467358
H  -3.939487 4.069329 1.910112
H  -0.627043 2.459309 2.885083
H  0.490195 5.413187 -0.016063
H  1.73871 2.166959 3.494115
H  2.863935 5.120652 0.607965
H  3.498187 3.490101 2.361648
elementType: Cl O N C H
totalener: -2050.68328747 hartree
nucrepener: 2840.44270940 hartree
electener: -4891.12599687 hartree
oneelecener: -8456.17435124 hartree
twoeener: 3565.04835437 hartree
cpcmener: -0.03086070 hartree
kineticenergy: 2044.48048942 hartree
xcener: -151.864403793071 hartree
chargesum: -0.0000000
charge: -0.048674 -0.054540 -0.286338 -0.441213 -0.331635 -0.086411 0.142306 -0.028138 -0.143925 -0.270398 -0.274473 -0.220113 0.391491 0.077520 0.404917 0.023504 -0.230436 -0.131867 -0.210198 0.188193 -0.118319 -0.214945 0.246184 -0.146899 -0.229611 -0.193513 -0.125163 -0.167153 0.115608 0.115563 0.086847 0.099492 0.099148 0.102465 0.090737 0.095848 0.140206 0.143270 0.146228 0.145308 0.158589 0.150153 0.157785 0.147026 0.168402 0.157923 0.159252
qa: -0.0487 -0.0545 -0.2863 -0.4412 -0.3316 -0.0864 0.1423 -0.0281 -0.1439 -0.2704 -0.2745 -0.2201 0.3915 0.0775 0.4049 0.0235 -0.2304 -0.1319 -0.2102 0.1882 -0.1183 -0.2149 0.2462 -0.1469 -0.2296 -0.1935 -0.1252 -0.1672 0.1156 0.1156 0.0868 0.0995 0.0991 0.1025 0.0907 0.0958 0.1402 0.1433 0.1462 0.1453 0.1586 0.1502 0.1578 0.1470 0.1684 0.1579 0.1593
va: 1.2838 1.2514 2.1002 2.0704 2.0696 3.1147 3.6960 3.8913 3.8495 3.8876 3.9205 3.9117 4.1294 4.1833 3.7201 3.6429 4.0740 3.8962 3.9881 3.8018 3.8995 4.0041 3.7312 3.8592 4.0008 3.8710 3.8927 3.8707 1.0193 1.0238 1.0060 1.0016 1.0211 1.0003 1.0085 1.0000 1.0085 1.0220 1.0180 1.0020 0.9892 1.0037 0.9974 1.0067 0.9833 0.9887 0.9901
dispcorr: -0.026880083 hartree
energy: -2050.710167549213
dipole: 2.18524 -0.86334 1.32189 23.57221 -23.51918 0.05303 29.42448 -27.08853 2.33595
magnitude: 2.68456 au
magnitude: 6.82362 debye
